program: Gaussian 09
title: 000075810
version: EM64L-G09RevD.01
frameworkgroup: C1[X(C6H8N2O2)]
method: RPBEPBE
basis: SDD
operation: Freq
keyword: #pfreq=noraman
keyword: PBEPBE/SDD
title: #p freq=noraman PBEPBE/SDD
converged: YES YES NO NO
title: Mulliken charges:
elementType: O O N N C C C C C C H H H H H H H H
charge: -0.414110 -0.248408 -0.096223 -0.115505 0.170806 -0.320102 -0.537147 -0.249371 -0.612497 0.208075 0.274364 0.274541 0.306870 0.258439 0.245551 0.245634 0.233358 0.375724
chargesum: 0.00000
title: Mulliken charges with hydrogens summed into heavy atoms:
elementType: O O N N C C C C C C
charge: -0.038386 -0.248408 -0.096223 -0.115505 0.170806 -0.013232 0.011758 0.009068 0.112046 0.208075
polarizability: 1.06812494e+02 3.89339369e+00 8.58179745e+01 1.20612832e-02 -3.75593525e-02 4.47971079e+01
1716.lowfreq: -15.0960 -7.0326 -1.9103 -0.0010 -0.0005 -0.0004 33.5401 41.2256 77.2718
frequency: 32.9829 41.0796 77.2705 128.2758 162.9676 271.7643 281.7187 348.0044 385.9684 491.0824 575.7632 617.5697 632.7241 646.1480 666.6693 758.3049 763.2099 804.9577 878.0883 952.8282 964.3713 1021.9672 1046.2151 1051.9796 1120.2940 1147.9633 1186.5456 1188.6231 1226.8718 1277.6382 1343.1213 1350.4008 1387.5672 1418.7665 1430.7196 1468.9991 1471.7370 1492.8375 1563.0702 1669.3256 2994.1212 2995.2417 3034.8636 3081.4644 3107.6614 3228.9616 3263.2111 3517.4386
redmass: 3.2818 6.5876 1.1031 5.2016 2.5405 5.2371 3.2051 7.8134 3.5468 1.9930 4.0503 2.7066 1.4381 4.8390 3.9280 1.4057 4.7810 1.3306 4.5823 2.4638 4.0278 4.5543 2.3142 1.5022 1.3213 1.6681 1.5817 1.1357 1.6737 3.0000 3.4470 5.4867 2.8416 1.7387 1.1115 1.0415 1.9357 1.0742 6.2595 8.2564 1.0346 1.0607 1.0962 1.1025 1.1006 1.0978 1.1015 1.0640
irintensity: 0.2454 5.0276 0.1771 7.0274 8.2230 0.1471 5.2122 6.9751 0.8666 23.0109 48.4471 0.5242 157.0733 0.8449 6.6414 1.3180 17.5556 58.4428 6.8885 12.8289 8.8374 84.3989 300.4828 6.8260 1.0286 24.8387 2.2152 0.0942 19.8216 3.0048 4.8186 9.8199 56.0345 22.1256 33.5180 14.7135 39.6281 12.8556 15.0767 184.9254 62.4295 8.4082 2.0791 23.0408 13.2885 1.6656 3.7418 25.0090
temp: 298.150 k
press: 1.00000 atm
elementType: 8 8 7 7 6 6 6 6 6 6 1 1 1 1 1 1 1 1
symmnumber: 1
zpe: 362285.2 jmol-1
zpe.correction: 0.137987 hartree
zpe.thermalcorrener: 0.147841 hartree
zpe.thermalcorrenthalpy: 0.148785 hartree
zpe.thermalcorrgfe: 0.101005 hartree
zpe.sumelectzpe: -492.637938 hartree
zpe.sumelectthermal: -492.628085 hartree
zpe.sumelectthermalent: -492.627141 hartree
zpe.sumelectthermalfe: -492.674921 hartree
dipole: -1.8139 -2.2593 0.0066
dipole: 2.8974
quadrupole: -38.4391 -64.4246 -59.2831
quadrupole: 3.5500 0.0148 0.0258
quadrupole: 15.6098 -10.3757 -5.2341 3.5500 0.0148 0.0258
hfenergy: -492.7759255 hartree
pointgroup: C01 [X(C6H8N2O2)]
dipole: -0.7689873 0.8157361 -0.2065905 debye
dipolederiv: -1.4144948 0.1797178 -0.117661 0.0995388 -0.2502846 -0.0220963 -0.1056667 -0.0154067 -0.439524 -0.7630166 -0.0298 -0.0348054 0.2369862 -0.8693067 0.1162845 -0.0808557 0.0927461 -0.3303818 -0.5932103 0.3304888 -0.0968565 0.3133386 -0.2953651 0.0570464 -0.0897549 0.0557442 -0.1337167 -0.5839408 0.1780764 -0.0581899 0.0770976 -0.3748647 0.026078 -0.0394811 0.0345602 -0.2686904 0.4321485 0.056775 0.0314716 0.0099265 0.0013731 -0.0112309 0.0365188 -0.0068274 -0.065128 0.1528829 -0.177527 0.0572285 0.0589523 -0.1570736 0.0021779 0.0164613 -0.0158547 -0.1685522 -0.0138816 -0.0863933 0.0001204 -0.1852493 -0.2462249 0.0482331 0.0164348 0.0552087 0.1345924 0.1448791 -0.1722925 0.0517672 -0.3093721 0.4085549 -0.1176207 0.0749207 -0.1062793 -0.10004 0.4129355 -0.2030195 0.050826 -0.2088033 0.2790023 -0.0250512 0.0496945 -0.0229247 0.2507405 1.737338 -0.0356352 0.1424349 -0.0684102 1.1096613 -0.1577251 0.1501213 -0.1540846 0.2517905 -0.0128958 0.0203035 0.0387785 0.0435555 0.0695998 -0.0636897 0.0715769 -0.0776865 0.0590032 0.0091195 -0.0061713 -0.0455435 0.0085507 0.1120552 0.0473887 -0.0834762 0.0582918 -0.0026123 0.1845443 0.010672 -0.0045634 -0.0095488 0.042175 0.0300997 -0.0009855 0.0313656 0.2153549 -0.0419186 -0.0554521 -0.0096247 -0.0305816 0.0911219 0.0153226 -0.0138671 0.013501 0.1914781 0.0426588 0.0308006 -0.0336335 0.1095826 -0.0546675 -0.0855142 0.0281138 -0.1220344 -0.009481 0.0416329 0.0263724 0.0357603 0.082375 0.0225213 0.0878982 -0.0507643 0.1146247 -0.0901125 -0.0618779 -0.032386 -0.007418 -0.1378385 0.0122505 0.0105252 0.011367 0.0180698 0.1193549 0.3270968 -0.0345298 -0.0000918 -0.0901001 0.0994718 0.0418739 0.0096422 0.0469863 0.3859246 unknown
polarizability: 106.8148585|-1.538416|84.1734944|5.4727424|-6.8886414|46.4392237 unknown
InChI: InChI=1S/C6H8N2O2/c1-8-3-5(7-4-8)2-6(9)10/h3-4,9H,2H2,1H3
charge 0 multiplicity 1
18 atoms
O  3.611514 0.280965 0.448214
O  1.877422 1.762766 0.041376
N  -2.173111 0.225028 -0.034595
N  -0.907695 -1.607895 0.384719
C  -0.072505 -0.480783 0.257754
C  -0.839531 0.659408 -0.001751
C  1.413341 -0.660187 0.408732
C  -2.160194 -1.146371 0.203323
C  -3.351168 1.065372 -0.278018
C  2.252142 0.592206 0.273352
H  1.784175 -1.395849 -0.331771
H  1.642421 -1.116132 1.391702
H  -0.545959 1.692329 -0.156067
H  -3.066993 -1.746749 0.233558
H  -3.430744 1.859829 0.484361
H  -3.301137 1.532814 -1.276958
H  -4.257723 0.440629 -0.228436
H  4.148246 1.11432 0.354406
