program: Gaussian 16
title: me_benzopiperidine_hydride
version: AS64L-G16RevC.02
method: RwB97XD
basis: GenECP
operation: Freq
keyword: #N
keyword: Geom=AllCheck
keyword: Guess=TCheck
keyword: SCRF=Check
keyword: GenChk
keyword: RwB97XD/GenECPFreq
converged: YES YES NO YES
title: Mulliken charges:
elementType: H C C C C H C H H B H C H H H C H H H C N C C C H H C H H C H H H H H H
charge: 0.177411 -0.459259 0.056177 -0.445877 0.016926 0.154255 -0.052101 0.185762 0.134496 -0.011568 -0.188932 -0.596391 0.093171 0.102049 0.097554 -0.574947 0.129366 0.103017 0.111784 -0.645426 0.536440 -0.278141 0.085171 -0.300332 0.141020 0.134678 -0.583201 0.188805 0.115116 -0.395864 0.176880 0.156721 0.172333 0.157515 0.175953 0.129436
chargesum: -1.00000
title: Mulliken charges with hydrogens summed into heavy atoms:
elementType: C C C C C B C C C N C C C C C
charge: -0.281848 0.210432 -0.260114 0.016926 0.082395 -0.200500 -0.303617 -0.230779 -0.645426 0.536440 -0.002443 0.389092 0.033269 -0.253353 -0.090475
1716.lowfreq: -48.1207 -19.5641 -0.0006 -0.0006 -0.0005 16.5334 68.0574 75.9663 89.0913
frequency: 64.5213 72.0006 88.5876 121.7630 139.0951 182.5036 235.4131 248.0306 254.9842 283.6275 299.5233 303.4542 318.4143 343.1508 375.9099 416.0903 470.6044 488.8782 498.5011 513.4716 534.9813 577.5831 644.8442 684.9373 732.2021 740.7540 760.6021 777.1109 788.1540 795.7509 840.3876 855.7820 869.2641 879.5759 908.9717 927.5837 941.0399 953.9469 962.5056 987.5065 990.1262 1008.3210 1053.9245 1065.7181 1070.6209 1087.5459 1092.5416 1096.1104 1140.5483 1164.6317 1168.1766 1172.5039 1181.5417 1193.2459 1253.9227 1260.0232 1266.7012 1291.2740 1302.5892 1304.8483 1307.6456 1324.2750 1356.5975 1365.4825 1389.9692 1394.4645 1407.2375 1432.1931 1466.7044 1470.6685 1475.5877 1480.7539 1484.3598 1487.2854 1491.1251 1494.7707 1501.7425 1508.7469 1519.0376 1626.0786 1643.5634 2237.3027 2867.3176 2872.6576 2961.8152 2967.4436 3012.0958 3016.7004 3023.2133 3036.2392 3038.2938 3045.0083 3067.3477 3068.6370 3084.3509 3089.3099 3097.5679 3135.9243 3153.8498 3170.2330 3181.3195 3192.0197
redmass: 3.0092 3.0660 3.3182 2.7643 3.3304 2.7731 2.5683 2.4089 1.3509 2.0729 2.0011 2.8950 1.3321 2.6230 2.5326 1.7967 3.1680 3.1298 2.5138 3.1963 2.3394 3.2908 3.5320 3.2439 1.2302 1.5350 1.9836 2.0341 2.5943 1.7699 1.4214 3.0785 1.3521 1.4196 1.5785 2.0622 2.1154 2.4679 1.6309 1.3267 1.3198 2.1101 2.6167 2.2500 2.0344 1.6112 1.5101 1.7444 1.6504 2.1616 2.3460 1.6728 1.1608 1.3342 1.8905 1.3164 1.9042 1.9516 1.2662 1.3823 1.4274 2.5372 1.3270 1.6041 1.5101 1.3709 1.3664 1.5901 1.0998 2.0473 1.0579 1.0904 1.0880 1.1114 1.0668 1.1262 1.1868 1.9908 1.0839 5.7094 5.6378 1.0789 1.0730 1.0713 1.0408 1.0378 1.0650 1.0965 1.0959 1.0620 1.0978 1.0631 1.0940 1.0948 1.1018 1.0895 1.1018 1.0888 1.0838 1.0889 1.0921 1.0964
irintensity: 0.5279 0.6089 1.7436 1.4243 3.8619 0.6570 2.5757 2.3919 0.2977 1.7398 0.1703 1.0021 0.2902 0.6396 0.3026 1.4632 1.7587 2.8166 4.1536 3.5252 4.0792 3.1669 1.0296 2.1555 33.8345 26.7162 11.0123 10.3375 12.3623 1.4366 1.5328 0.2612 3.8480 7.1206 4.8678 12.6176 4.6702 28.1886 2.5933 3.1297 1.2789 20.5267 18.2845 53.9134 25.7355 8.4820 16.4078 35.6882 45.2694 19.2201 42.1335 25.9100 9.0250 17.1477 117.7324 36.2341 10.2720 15.3534 3.4863 47.7201 5.8178 22.7914 2.4506 16.7431 0.7860 2.0470 0.4238 33.7693 8.2978 28.9277 0.7563 1.3660 12.4556 18.0265 3.1204 26.7036 16.7521 47.7526 2.1243 10.4391 33.0098 504.8419 47.1552 300.1064 124.5792 104.9425 58.5446 115.6279 127.4380 42.3731 128.1605 57.0705 134.1127 85.2186 44.5320 29.7928 66.2480 4.5216 1.7386 24.5613 81.0117 45.5050
temp: 298.150 k
press: 1.00000 atm
elementType: 1 6 6 6 6 1 6 1 1 5 1 6 1 1 1 6 1 1 1 6 7 6 6 6 1 1 6 1 1 6 1 1 1 1 1 1
symmnumber: 1
zpe: 831367.9 jmol-1
zpe.correction: 0.316651 hartree
zpe.thermalcorrener: 0.331086 hartree
zpe.thermalcorrenthalpy: 0.332030 hartree
zpe.thermalcorrgfe: 0.276443 hartree
zpe.sumelectzpe: -587.375454 hartree
zpe.sumelectthermal: -587.361019 hartree
zpe.sumelectthermalent: -587.360075 hartree
zpe.sumelectthermalfe: -587.415662 hartree
dipole: -20.9640 -10.6873 0.1758
dipole: 23.5316
quadrupole: -199.6032 -135.7642 -107.1735
quadrupole: -49.7027 2.5017 1.8459
quadrupole: -52.0896 11.7495 40.3401 -49.7027 2.5017 1.8459
hfenergy: -587.6921053 hartree
pointgroup: C01 [X(C13H21B1N1)]
dipole: 1.1103958 -3.3462074 0.279082 debye
polarizability: 251.3665071|-4.584125|232.4389076|0.8985534|-1.097017|169.4193807 unknown
InChI: InChI=1/C13H21BN/c1-14(2)12-8-4-5-9-13(12)15-10-6-3-7-11-15/h4-5,8-9,14H,3,6-7,10-11H2,1-2H3
charge -1 multiplicity 1
36 atoms
H  0.37334034 0.60333419 0.19071687
C  1.44391615 0.41760639 0.17573491
C  2.34112619 1.48541664 0.21348325
C  1.93033799 -0.87832292 0.10549741
C  3.73556119 1.34068341 0.17738119
H  1.93140761 2.49061775 0.24705474
C  3.30835599 -1.07786993 0.09677137
H  1.25583074 -1.72871141 0.06937248
H  3.69105833 -2.09287187 0.06569308
B  4.71020992 2.6658264 0.06576031
H  5.5981221 2.6144433 0.93228096
C  5.4249405 2.68140285 -1.4189617
H  6.09994129 3.54382526 -1.53224269
H  6.01508126 1.77592767 -1.60635016
H  4.67622605 2.75572287 -2.22491216
C  3.88518126 4.07096173 0.2917403
H  4.57651305 4.92552474 0.25986127
H  3.12974625 4.25744851 -0.4894671
H  3.36209054 4.12526702 1.2587854
C  4.19869441 -0.00017608 0.13598627
N  5.60437165 -0.25504984 0.13155653
C  6.24729225 -0.08230267 1.42595558
C  6.0668443 -1.44984788 -0.54328035
C  7.75726073 0.05396577 1.26487117
H  5.83694696 0.81035348 1.89448922
H  6.02316362 -0.95020364 2.08244751
C  7.56965813 -1.35773262 -0.80300088
H  5.52517275 -1.55069683 -1.48723537
H  5.87194847 -2.36956298 0.04842158
C  8.33281542 -1.14034761 0.50376743
H  8.22591733 0.14423019 2.25075009
H  7.96000103 0.97954096 0.71587388
H  7.91196971 -2.27134428 -1.30146722
H  7.75383725 -0.51876829 -1.48310434
H  9.4009318 -0.99979675 0.30805437
H  8.23895441 -2.04149457 1.12556083
