program: Gaussian 16
title: me_benzopyrrolidine_hydride
version: AS64L-G16RevC.02
method: RwB97XD
basis: GenECP
operation: Freq
keyword: #N
keyword: Geom=AllCheck
keyword: Guess=TCheck
keyword: SCRF=Check
keyword: GenChk
keyword: RwB97XD/GenECPFreq
converged: YES YES YES YES
title: Mulliken charges:
elementType: H C C C C H C H C H B H C H H H C H H H N C C C H H C H H H H H H
charge: 0.173337 -0.459438 -0.045721 -0.547462 0.004088 0.143891 -0.021970 0.184802 -0.142005 0.140028 0.020603 -0.159338 -0.650295 0.119065 0.100974 0.109426 -0.584484 0.080701 0.098047 0.105163 0.430865 -0.175331 0.045571 -0.439132 0.158442 0.092136 -0.687312 0.176797 0.100963 0.163987 0.147518 0.162875 0.153211
chargesum: -1.00000
title: Mulliken charges with hydrogens summed into heavy atoms:
elementType: C C C C C C B C C N C C C C
charge: -0.286101 0.098169 -0.362661 0.004088 0.118058 -0.142005 -0.138735 -0.320830 -0.300573 0.430865 0.075247 0.323331 -0.127628 -0.371226
1716.lowfreq: -20.2195 -0.0002 0.0001 0.0005 21.7562 32.2205 66.3142 91.0344 94.0007
frequency: 64.9763 88.6655 92.0764 137.8595 147.0467 181.0339 228.0706 263.7931 290.3109 302.7933 309.7278 315.9014 336.8629 370.6287 383.5364 480.8549 504.8874 534.4203 576.9735 652.3975 662.6204 694.1071 737.2494 757.5137 765.9555 779.9701 783.7254 811.0201 864.1870 873.1987 884.8759 913.0052 924.3701 945.9722 960.2860 982.0732 988.9080 991.9512 1006.8069 1012.8047 1065.1984 1075.1053 1103.1290 1117.9168 1132.3204 1154.1454 1167.4512 1190.5042 1215.7537 1223.1915 1242.3452 1245.4688 1277.0817 1291.5800 1298.0163 1306.0341 1319.7754 1324.2032 1331.3566 1365.6455 1377.2043 1412.5456 1468.6129 1475.6706 1487.1321 1488.1517 1491.5682 1503.3146 1511.4940 1514.6349 1521.2517 1542.6528 1625.3548 1644.4231 2225.3722 2896.9896 2912.6046 2970.5986 2977.3237 3026.7000 3031.7465 3048.3360 3057.6522 3070.0329 3078.4883 3083.0940 3098.0001 3119.5870 3155.1465 3163.3787 3174.3814 3190.6765 3205.9862
redmass: 2.8559 2.3607 2.9329 2.3989 2.7858 2.7695 3.0980 2.8957 1.4796 1.7669 2.7582 1.7036 1.6237 2.2760 3.2759 3.4219 3.3017 3.0837 3.2617 4.0443 3.2822 3.2793 1.4788 1.6892 1.2103 2.1789 2.0096 1.4340 1.4011 2.3454 1.4836 1.6396 2.6909 1.7772 1.6401 1.7464 2.1036 1.4076 1.9571 2.4844 2.5181 2.0540 1.8326 1.7849 1.6646 1.5896 1.7547 1.2295 2.9869 1.4104 1.5422 1.1986 1.3439 1.3525 1.6361 1.7897 1.5561 1.7240 1.3989 1.7185 1.4250 1.6428 1.8763 1.1595 1.0661 1.0580 1.0730 1.1200 1.3847 1.4641 1.1651 1.0908 5.4233 5.3806 1.0795 1.0726 1.0735 1.0404 1.0397 1.0981 1.0939 1.0982 1.0601 1.0656 1.0914 1.0859 1.1056 1.1060 1.0843 1.0894 1.0918 1.0922 1.0923
irintensity: 1.0889 2.0367 0.4825 1.5193 1.8086 3.7094 0.4488 1.9217 1.7682 2.8476 0.6157 4.3648 1.9266 0.8844 5.4835 3.1089 0.3887 6.0331 1.7758 0.3360 1.0493 0.8272 57.2980 1.8340 4.6925 0.7026 28.9540 0.5996 2.6771 6.6954 0.7373 7.4983 6.2840 7.4704 4.3421 5.9704 8.9151 0.7568 31.3467 10.0223 54.9250 23.9201 15.7725 33.7487 5.8861 24.1105 93.1477 10.3386 27.1266 42.2247 62.8289 14.3687 31.4087 24.4656 45.2235 47.7365 56.9215 8.7767 14.9188 46.0011 1.2957 36.4847 56.6711 4.0082 5.3677 1.6729 4.3446 18.4878 71.0371 21.2960 8.0459 1.4982 7.7375 62.5583 495.3885 119.5606 201.3594 79.5229 141.1978 69.8657 162.1774 122.4345 37.0300 124.0498 73.3660 34.5556 2.1219 97.6630 4.3718 18.4138 46.0798 67.7833 30.9420
temp: 298.150 k
press: 1.00000 atm
elementType: 1 6 6 6 6 1 6 1 6 1 5 1 6 1 1 1 6 1 1 1 7 6 6 6 1 1 6 1 1 1 1 1 1
symmnumber: 1
zpe: 757234.6 jmol-1
zpe.correction: 0.288415 hartree
zpe.thermalcorrener: 0.301829 hartree
zpe.thermalcorrenthalpy: 0.302773 hartree
zpe.thermalcorrgfe: 0.249326 hartree
zpe.sumelectzpe: -548.083094 hartree
zpe.sumelectthermal: -548.069681 hartree
zpe.sumelectthermalent: -548.068736 hartree
zpe.sumelectthermalfe: -548.122184 hartree
dipole: -20.5189 -10.9092 -0.7208
dipole: 23.2498
quadrupole: -188.1437 -129.1176 -100.3680
quadrupole: -51.5466 -1.6831 -0.9233
quadrupole: -48.9339 10.0921 38.8418 -51.5466 -1.6831 -0.9233
hfenergy: -548.3715097 hartree
pointgroup: C01 [X(C12H19B1N1)]
dipole: 0.9508498 -3.2236329 -0.4027786 debye
polarizability: 240.7832354|-3.386399|220.4896759|-5.0334563|10.3953084|155.4684325 unknown
InChI: InChI=1/C12H19BN/c1-13(2)11-7-3-4-8-12(11)14-9-5-6-10-14/h3-4,7-8,13H,5-6,9-10H2,1-2H3
charge -1 multiplicity 1
33 atoms
H  0.44341184 0.56417826 0.379845
C  1.50802469 0.38963563 0.25118689
C  2.41651135 1.43787328 0.40616479
C  1.9826263 -0.86448085 -0.08962563
C  3.80348819 1.32368115 0.24034483
H  2.0147966 2.41661774 0.64662254
C  3.35412859 -1.04827086 -0.24010485
H  1.30564919 -1.70176416 -0.23243928
C  4.2619755 0.00873396 -0.07316911
H  3.71506268 -2.03914605 -0.48918745
B  4.726323 2.69665466 0.32465083
H  5.43864867 2.6475206 1.34338941
C  3.80792945 4.05512588 0.47239457
H  3.12136594 4.2059816 -0.37698918
H  3.19513049 4.08719334 1.38511825
H  4.46051305 4.93929465 0.505529
C  5.68287804 2.85495922 -1.00757455
H  6.24443235 3.80124359 -0.97771401
H  6.40968138 2.04468155 -1.1394994
H  5.07348181 2.87720121 -1.92566422
N  5.63799432 -0.2538549 -0.26783096
C  6.58227667 0.05929614 0.79605727
C  6.0694842 -1.52988169 -0.7992893
C  7.9384521 -0.33992835 0.20323064
H  6.35850876 -0.54797801 1.69351041
H  6.52105215 1.10828181 1.07436985
C  7.59338662 -1.3827548 -0.88711631
H  5.60200508 -1.72985209 -1.76707072
H  5.81540628 -2.36945767 -0.12226691
H  8.42641853 0.53165557 -0.23899026
H  8.60751393 -0.74094266 0.96833425
H  7.87848539 -1.01347495 -1.87466189
H  8.09752488 -2.3398718 -0.73248952
