program: Gaussian 16
title: me_biphenylene_hydride
version: AS64L-G16RevC.02
method: RwB97XD
basis: GenECP
operation: Freq
keyword: #N
keyword: Geom=AllCheck
keyword: Guess=TCheck
keyword: SCRF=Check
keyword: GenChk
keyword: RwB97XD/GenECPFreq
converged: YES YES NO YES
title: Mulliken charges:
elementType: C C C C C C C H C H H C H C H C C H B N C H H H C H H H C H H H C H H H H
charge: 0.085928 0.280090 0.293346 -0.065777 -0.457211 -0.164766 -0.390820 0.167949 -0.240283 0.210085 0.166579 -0.427639 0.177300 -0.424660 0.194134 0.106277 -0.145933 0.172002 -0.140545 0.237983 -0.594685 0.139321 0.082175 0.114006 -0.620252 0.115544 0.113826 0.100573 -0.401380 0.144242 0.171184 0.157379 -0.421232 0.166863 0.153506 0.112787 -0.167897
chargesum: -1.00000
title: Mulliken charges with hydrogens summed into heavy atoms:
elementType: C C C C C C C C C C C C B N C C C C
charge: 0.085928 0.280090 0.293346 -0.065777 -0.289262 -0.164766 -0.180735 -0.073704 -0.250339 -0.230527 0.278279 -0.145933 -0.308442 0.237983 -0.259183 -0.290309 0.071425 0.011924
1716.lowfreq: -26.2242 -0.0001 0.0003 0.0004 10.7854 25.6537 53.7867 77.4936 86.0805
frequency: 51.9327 76.7328 84.0942 109.6023 123.8961 144.5823 169.5967 177.6887 214.4901 248.5781 265.8710 270.6936 282.1739 290.3565 306.4285 327.2525 346.3858 363.8743 369.3566 396.5514 469.3938 476.1522 488.1659 543.7798 566.4433 580.1105 607.1020 640.4816 646.2149 727.4184 733.3612 740.5781 759.2412 769.3995 780.6618 789.4571 804.3883 823.8972 880.9236 890.8692 898.4659 920.3745 957.4456 968.2360 993.5341 997.9433 1000.5845 1016.9442 1051.2789 1067.9148 1091.6835 1096.9772 1121.4459 1128.6483 1132.7954 1171.3587 1174.5988 1179.0406 1192.9014 1199.1393 1220.8316 1241.5047 1288.6007 1294.8994 1298.1856 1306.4849 1386.3348 1397.2541 1435.6640 1454.7217 1472.0761 1477.0343 1478.7686 1480.4925 1484.7804 1487.5907 1499.0868 1499.8194 1504.0598 1506.1139 1514.6697 1535.0720 1622.0218 1646.6332 1661.0744 1725.4533 2245.4523 2940.8155 2950.4847 2961.8186 2966.7145 3016.7547 3018.3761 3037.7793 3074.9621 3080.2422 3092.9734 3127.0539 3157.0397 3175.2668 3182.3038 3187.3381 3193.2827 3201.2703 3218.1328
redmass: 3.3620 2.9942 2.6811 3.7519 3.0138 3.0048 3.5072 2.6903 1.4365 1.2763 1.5808 2.4189 1.5975 2.2821 1.4418 2.3087 3.4409 4.2435 2.7960 2.7170 4.4109 3.6212 3.7428 3.0567 3.5862 3.5148 5.8064 4.9804 4.5481 2.9841 3.0371 3.6229 1.1487 1.5991 1.5257 2.8391 1.4807 5.0000 1.4143 3.5417 1.6206 1.5739 2.1231 1.2896 2.0690 2.0085 3.7142 2.0942 2.9186 1.9560 1.4110 1.5954 1.9600 1.4671 1.5780 1.6136 1.4820 1.7942 1.7254 2.0154 2.2811 1.8470 2.4434 1.3146 3.8056 1.2494 2.7743 2.4455 2.5379 1.1986 1.0815 1.1250 1.1169 1.1835 1.1537 1.6500 1.7858 1.0883 1.2212 1.4481 1.4360 1.5702 8.5347 8.8983 6.7870 8.2370 1.0797 1.0588 1.0587 1.0392 1.0406 1.0980 1.0970 1.0967 1.0934 1.0729 1.0822 1.1038 1.0857 1.0871 1.0908 1.0968 1.0958 1.0942 1.0919
irintensity: 2.2210 0.1764 0.4078 7.9370 0.6562 3.1173 1.0989 0.8930 2.6309 0.3703 0.5590 0.5384 0.2995 11.4511 0.1598 1.2325 2.0607 3.7286 0.0696 1.0431 1.2253 0.8899 2.5588 3.2363 3.9845 3.6677 1.2455 4.3716 2.1619 9.7023 23.3005 17.9468 19.9583 2.0369 85.4739 13.7691 1.7870 1.8357 0.5857 9.6967 6.9647 2.5221 8.4000 0.8087 32.3098 18.1292 8.5487 25.6478 6.6045 6.8903 10.1183 45.1793 13.7874 13.8467 28.0071 114.1895 43.3957 43.0228 22.0964 3.0403 23.2461 6.4217 25.0624 28.1961 17.9796 25.1512 126.7236 19.2760 28.3352 1.9257 3.0983 7.3922 5.5050 37.0941 17.9364 7.2975 4.9497 48.9482 2.3562 2.6994 3.5499 125.0578 12.2998 80.9084 45.0499 93.8629 476.6987 140.6509 246.4960 85.9519 122.0236 45.9122 176.6599 128.8190 43.0521 46.7664 42.3940 29.6118 11.9361 15.9867 41.1692 7.3281 60.4121 35.8518 26.0975
temp: 298.150 k
press: 1.00000 atm
elementType: 6 6 6 6 6 6 6 1 6 1 1 6 1 6 1 6 6 1 5 7 6 1 1 1 6 1 1 1 6 1 1 1 6 1 1 1 1
symmnumber: 1
zpe: 810151.6 jmol-1
zpe.correction: 0.308570 hartree
zpe.thermalcorrener: 0.325414 hartree
zpe.thermalcorrenthalpy: 0.326358 hartree
zpe.thermalcorrgfe: 0.265576 hartree
zpe.sumelectzpe: -700.405519 hartree
zpe.sumelectthermal: -700.388675 hartree
zpe.sumelectthermalent: -700.387731 hartree
zpe.sumelectthermalfe: -700.448513 hartree
dipole: -9.4729 -7.4214 -6.7598
dipole: 13.8024
quadrupole: -142.4654 -133.5552 -135.2885
quadrupole: -15.4418 -16.6574 -0.1502
quadrupole: -5.3624 3.5479 1.8145 -15.4418 -16.6574 -0.1502
hfenergy: -700.7140894 hartree
pointgroup: C01 [X(C16H19B1N1)]
dipole: -0.5009784 3.2953153 -1.7703099 debye
polarizability: 167.6121182|-10.3941138|348.8916136|-7.6457071|3.025669|297.7119471 unknown
InChI: InChI=1/C16H19BN/c1-17(2)13-9-5-7-11-12-8-6-10-14(18(3)4)16(12)15(11)13/h5-10,17H,1-4H3
charge -1 multiplicity 1
37 atoms
C  1.66002851 2.5105771 -0.08523766
C  1.70599311 2.55752285 -1.501297
C  1.68095252 4.05438997 -1.47988833
C  1.60213404 4.0466996 -0.06887351
C  1.75117039 5.18741057 -2.24497461
C  1.53338465 5.2320448 0.64842508
C  1.7167595 6.39684442 -1.5222359
H  1.83222537 5.17316077 -3.3255546
C  1.60361119 6.41710714 -0.14442923
H  1.76527736 7.34230768 -2.05349829
H  1.55550913 7.38215125 0.34408546
C  1.78384417 1.44602221 -2.29156367
H  1.82513991 1.47969104 -3.37494109
C  1.81824184 0.22546639 -1.58120735
H  1.87178379 -0.71042796 -2.13078364
C  1.80093674 0.19603752 -0.19619466
C  1.73960327 1.34326087 0.6588096
H  1.8518005 -0.77866596 0.27942273
B  1.83327813 1.19584465 2.29021536
N  1.41454784 5.28817975 2.04021448
C  3.00611651 2.19697158 2.86500427
H  2.87078971 3.24823592 2.58207767
H  3.0608136 2.16460278 3.96393952
H  3.99707669 1.89553852 2.48905412
C  2.14047266 -0.34881764 2.76194811
H  3.09386829 -0.73342158 2.3634328
H  2.21758222 -0.40294746 3.85749981
H  1.36055711 -1.06903181 2.47205659
C  1.50559451 6.57743163 2.68405719
H  0.63528136 7.2282354 2.48511637
H  1.56480889 6.42015338 3.76335514
H  2.41131095 7.10240151 2.37323435
C  0.3976085 4.43209704 2.62870428
H  0.61934096 4.27180818 3.68669357
H  -0.6060275 4.88248516 2.53874828
H  0.39537702 3.45389792 2.15678332
H  0.73213455 1.5158518 2.76927044
