program: Gaussian 16
title: me_cinnoline_hydride
version: AS64L-G16RevC.02
method: RwB97XD
basis: GenECP
operation: Freq
keyword: #N
keyword: Geom=AllCheck
keyword: Guess=TCheck
keyword: SCRF=Check
keyword: GenChk
keyword: RwB97XD/GenECPFreq
converged: YES YES YES YES
title: Mulliken charges:
elementType: C C C C C C H H H B N C C H H H C H H H C H H H N
charge: -1.272239 0.006398 0.020022 -0.411113 -0.483755 0.672696 0.153010 0.212597 0.153921 -0.096328 0.102384 0.734826 -0.618710 0.221316 0.214096 -0.099693 -0.567136 0.102353 0.130683 0.100289 -0.563615 0.110679 0.096632 0.105540 -0.024853
chargesum: -1.00000
title: Mulliken charges with hydrogens summed into heavy atoms:
elementType: C C C C C C B N C C C C N
charge: -1.272239 0.006398 0.173032 -0.198517 -0.329834 0.672696 -0.196021 0.102384 0.948923 -0.397394 -0.233810 -0.250765 -0.024853
1716.lowfreq: -8.8079 -0.0005 -0.0005 -0.0003 25.5531 32.1356 81.3938 93.2601 173.4896
frequency: 80.7671 93.0930 173.1928 174.2407 187.2587 222.5056 280.0775 291.7827 314.4668 347.4725 416.9273 442.4336 474.5845 490.6846 544.6816 568.4820 587.9552 687.6946 692.3371 751.3300 759.5447 773.7445 794.4726 818.8924 828.7984 865.4133 866.4402 894.5498 923.7346 954.4007 992.2733 999.9108 1009.5935 1028.3588 1062.0168 1090.7390 1107.5094 1137.4740 1148.6009 1191.0113 1219.1533 1267.3380 1288.5383 1302.8756 1306.4505 1326.0522 1398.0183 1442.0251 1454.7538 1471.5441 1476.0030 1487.8481 1495.5085 1543.7153 1588.7537 1655.0949 1666.0564 2279.6989 2962.7587 2968.4733 3019.1472 3022.8298 3041.6422 3079.0589 3161.3638 3177.5402 3183.0454 3193.1967 3200.8962
redmass: 3.5811 2.9714 2.8777 3.8833 3.4086 1.3561 1.3104 2.1233 2.7983 2.3153 3.6536 4.3967 3.5484 3.9004 7.0910 4.9359 3.1080 5.2121 4.7277 1.1719 2.3872 1.1972 1.4679 4.5479 5.0368 1.3876 4.3390 1.5311 1.6312 1.8239 1.3399 2.3118 1.3579 2.4641 3.7992 1.8016 1.9409 1.6825 2.0294 1.4330 1.9626 1.9449 1.2605 1.5422 1.6927 3.0755 7.9827 2.9878 1.8411 1.0586 1.0572 1.0567 1.0512 3.2916 6.8660 5.5621 6.4966 1.0825 1.0404 1.0413 1.0939 1.0959 1.0979 1.0936 1.0856 1.0880 1.0923 1.0944 1.0977
irintensity: 2.9350 0.3671 0.4139 1.2741 1.5069 0.0876 0.4155 3.8112 0.1703 0.1712 0.7371 1.6717 3.5745 5.5658 2.4413 0.3649 1.8244 2.8174 2.3946 6.4906 1.5802 29.6857 1.3488 9.0157 5.6999 63.6508 3.7751 1.9620 5.5543 5.5799 0.2700 18.7530 0.6970 9.1166 3.4325 30.9882 27.5026 52.0471 105.5859 14.6836 22.1397 3.5848 34.4047 16.9303 17.4402 0.2543 131.0502 25.9286 7.0420 0.7215 1.3230 1.6317 3.3059 9.2435 28.4709 1.7952 19.9953 435.7231 96.3704 133.0373 98.4814 148.1616 125.5352 75.1349 9.7972 7.6187 31.4929 52.9781 46.3566
temp: 298.150 k
press: 1.00000 atm
elementType: 6 6 6 6 6 6 1 1 1 5 7 6 6 1 1 1 6 1 1 1 6 1 1 1 7
symmnumber: 1
zpe: 524854.5 jmol-1
zpe.correction: 0.199907 hartree
zpe.thermalcorrener: 0.211198 hartree
zpe.thermalcorrenthalpy: 0.212142 hartree
zpe.thermalcorrgfe: 0.163371 hartree
zpe.sumelectzpe: -522.458899 hartree
zpe.sumelectthermal: -522.447608 hartree
zpe.sumelectthermalent: -522.446664 hartree
zpe.sumelectthermalfe: -522.495435 hartree
dipole: -8.2625 7.5824 0.8694
dipole: 11.2480
quadrupole: -106.4503 -94.6351 -90.4818
quadrupole: 4.8274 5.0367 -2.6884
quadrupole: -9.2612 2.5540 6.7073 4.8274 5.0367 -2.6884
hfenergy: -522.658806 hartree
pointgroup: C01 [X(C10H12B1N2)]
dipole: -2.7144907 3.2978781 -0.9202544 debye
dipolederiv: 0.313662 0.2767375 -0.132415 -0.2135198 -0.2622699 0.1722801 0.0812077 0.1124982 0.1046679 -0.1636316 -0.1001042 0.0728348 -0.4222819 0.2876644 -0.1610704 0.188878 -0.1562613 -0.1218772 0.0729653 -0.0330981 -0.0259691 0.4904997 -0.5624443 0.128908 -0.2157155 0.1519105 -0.2288087 0.4403039 -0.1930686 0.0420705 -0.2312433 0.2966668 -0.147141 0.0286187 -0.136902 -0.0579389 -0.4776849 0.033315 -0.0077907 -0.307892 -0.0815471 -0.0292574 0.1447068 -0.0689466 -0.230836 -0.1589686 -0.022583 0.036256 0.6660912 0.182638 -0.1066766 -0.2343376 -0.0430191 0.1058227 -0.126164 -0.0669327 0.0537576 -0.0601674 0.093815 0.0190591 0.0481931 0.0160409 0.1064054 0.0453773 -0.0918769 0.0460283 -0.0766404 -0.1176799 0.1111205 0.0412437 0.1113237 0.0916332 -0.0359894 0.1430664 -0.0359838 0.073873 -0.053659 0.0778658 -0.0101357 0.0713038 0.1362588 0.7408998 -0.0334509 -0.0388331 -0.0316074 0.4480413 0.0722873 -0.1104003 0.1340272 0.5123676 -0.1140198 0.3769201 -0.1564176 0.0832041 -0.0362279 -0.0757606 -0.0682187 -0.090239 -0.1952339 -0.0125303 0.0056142 -0.0151711 -0.1933763 0.1622468 -0.0913602 0.0620962 -0.1085683 -0.0771758 0.2432138 0.0355985 -0.0415527 0.1844739 -0.1426481 0.0369265 -0.0880993 0.0432844 -0.0268295 -0.1502265 -0.0243748 0.0372604 -0.0402174 0.0891725 0.0262489 0.0446999 0.025635 0.1301798 -0.0215796 0.0805654 -0.0168639 0.1432933 -0.0222765 0.0459677 -0.0413786 0.050509 0.1141097 -0.2980531 -0.0679943 -0.0908987 -0.0096194 -0.5571374 -0.1662016 -0.0432659 -0.2024906 -0.2873735 -0.4680123 0.0088953 0.1807747 0.0011735 0.0415609 0.0605109 0.1551249 0.0364896 -0.015635 -0.0254463 -0.1168976 -0.0537359 -0.1940289 -0.1830626 -0.1063649 -0.0921266 -0.1239085 -0.0231861 -0.1328726 0.1753799 -0.0417034 0.2527032 -0.1594791 0.0309442 -0.0744138 0.0511393 0.0498872 0.0624866 -0.0103873 0.0194671 -0.0335504 0.0276085 0.072807 0.0815388 0.0558584 -0.3276478 -0.0924127 0.063274 -0.0023507 0.0669842 0.0280539 0.1154971 0.0738118 0.0559288 -0.3884841 -0.1573792 -0.0716084 0.1854468 -0.0594936 0.032761 0.0337194 0.1403941 0.0034744 -0.0035623 -0.12875 0.2025082 -0.1287873 0.2116234 -0.1746893 0.1305876 -0.1290294 0.1179329 -0.0058627 0.0067476 -0.0718126 -0.0814746 -0.1236287 -0.1716994 -0.2208656 -0.0559261 -0.1091064 -0.0709556 -0.3619355 -0.4976849 0.1960513 -0.1766526 -0.1654085 -0.0300317 0.0725337 0.0020858 -0.2899253 unknown
polarizability: 232.877567|2.2995224|194.2980477|-10.8356448|-34.0859648|133.9431931 unknown
InChI: InChI=1/C10H12BN2/c1-11(2)9-5-3-4-8-6-7-12-13-10(8)9/h3-7,11H,1-2H3
charge -1 multiplicity 1
25 atoms
C  -0.20208595 0.05477494 -0.69636569
C  1.22737399 0.13398939 -0.88154066
C  1.67504679 1.3372168 -1.39801603
C  0.82966981 2.42146657 -1.72959324
C  -0.52423612 2.33858266 -1.55633616
C  -1.06384778 1.14017557 -1.03348616
H  2.73970438 1.4643033 -1.56568324
H  1.26749043 3.33136671 -2.13102154
H  -1.18719262 3.15988841 -1.80998953
B  2.26044119 -1.08211623 -0.50631498
N  -0.71519448 -1.10645564 -0.19155261
C  -2.43944038 0.94553262 -0.82183829
C  -2.84750398 -0.25403076 -0.31215924
H  -3.89175795 -0.47653869 -0.12237531
H  -3.15332129 1.72849686 -1.0586497
H  1.83847485 -2.10747414 -1.05735206
C  3.78094972 -0.77941106 -1.05645788
H  4.25292171 0.09132456 -0.57144035
H  4.43523884 -1.63735259 -0.84561058
H  3.83326719 -0.60667515 -2.14245331
C  2.29312569 -1.30038216 1.12477009
H  1.31135353 -1.56604716 1.5340635
H  2.99251961 -2.10188061 1.40547326
H  2.63037686 -0.3906236 1.64856923
N  -1.98824302 -1.25770161 -0.0045125
