program: Gaussian 16
title: Me_Me-H-
version: ES64L-G16RevC.01
method: RwB97XD
basis: GenECP
operation: Freq
keyword: #N
keyword: Geom=AllCheck
keyword: Guess=TCheck
keyword: SCRF=Check
keyword: GenChk
keyword: RwB97XD/GenECPFreq
converged: YES YES YES YES
title: Mulliken charges:
elementType: C C C C C C H H H H N B C H H H C H H H H C H H H C H H H
charge: -0.400912 -0.036699 -0.022475 -0.189842 -0.198255 -0.435988 0.175918 0.143352 0.130767 0.182827 0.269049 0.006854 -0.327219 0.115464 0.144172 0.166448 -0.330231 0.154786 0.122645 0.086976 -0.140981 -0.582926 0.080121 0.085938 0.100419 -0.630383 0.115865 0.115147 0.099165
chargesum: -1.00000
title: Mulliken charges with hydrogens summed into heavy atoms:
elementType: C C C C C C N B C C C C
charge: -0.224994 0.106653 -0.022475 -0.189842 -0.067488 -0.253162 0.269049 -0.134127 0.098864 0.034176 -0.316447 -0.300207
1716.lowfreq: -45.2411 -33.6484 -0.0005 -0.0003 0.0001 8.0255 49.0515 76.3437 87.0488
frequency: 44.8251 75.2572 86.5875 127.7547 184.4230 241.5074 251.3267 275.9612 282.8963 291.6238 314.9885 326.8740 331.4394 364.6524 389.9707 463.0452 500.2718 534.9922 564.9497 584.1939 673.7848 741.7200 747.3190 753.6848 780.7691 792.5852 797.3922 861.1378 905.5042 941.9047 958.2533 983.5169 989.8229 1007.4891 1067.3489 1086.1517 1095.8234 1109.8402 1126.2477 1152.0440 1168.5342 1178.0681 1181.0268 1201.6169 1256.9883 1279.9863 1292.0475 1306.0553 1331.5306 1363.6269 1442.0092 1465.0822 1468.8793 1475.8834 1478.5806 1483.0337 1483.6196 1490.5061 1497.6661 1517.9223 1519.1968 1526.7249 1626.3399 1646.3049 2226.5820 2904.2496 2915.8591 2965.5902 2970.9313 3022.1135 3024.6561 3034.9676 3054.2139 3055.9267 3064.5835 3115.6024 3155.2436 3161.2084 3174.0615 3188.3742 3202.7211
redmass: 2.7284 3.0952 2.7973 2.8338 2.8431 1.2481 1.4068 1.3592 2.0999 1.4549 2.0527 1.2939 2.4133 2.7025 2.6733 2.9743 3.1061 3.2034 3.9072 3.3765 4.3759 1.7779 1.5761 1.3783 2.2160 3.5504 1.4300 1.3280 1.6494 1.6639 1.8284 1.3488 2.8098 2.1153 2.3066 1.4608 2.0391 1.8221 1.2880 1.5656 1.6710 1.4218 1.8145 1.2791 3.5251 1.2992 1.2551 2.8782 2.1903 2.6443 1.1675 1.4566 1.0770 1.2733 1.1968 1.0558 1.0825 1.1424 1.0531 1.2476 1.4181 1.1808 5.3092 5.1835 1.0791 1.0618 1.0610 1.0372 1.0398 1.0969 1.0958 1.0978 1.0786 1.0706 1.0970 1.1010 1.0841 1.0962 1.0907 1.0924 1.0929
irintensity: 2.6128 0.6938 1.0036 2.6761 2.3210 2.3642 0.5416 2.4009 1.2128 1.0978 0.6576 1.6810 3.9967 0.7079 1.1550 2.6668 1.6229 6.1434 6.7991 2.1970 2.3720 43.9263 22.9114 2.2771 21.2548 5.5067 1.0903 1.8748 4.8028 9.7426 12.8584 7.4412 40.3947 18.4324 73.3806 10.7774 35.1016 31.2857 9.9148 31.6516 95.8434 27.6925 44.2258 22.8159 25.2188 32.4096 32.2895 45.5504 9.9852 80.7286 2.3303 17.6478 2.4258 9.8299 6.4844 24.5026 11.6546 13.1945 1.0873 8.0693 34.3503 47.4507 9.9572 43.3564 530.6073 124.6094 294.6863 90.3240 124.2363 58.3916 152.8485 161.3085 62.7785 103.8138 70.2139 37.1281 3.6438 8.2927 38.7031 68.4342 33.8328
temp: 298.150 k
press: 1.00000 atm
elementType: 6 6 6 6 6 6 1 1 1 1 7 5 6 1 1 1 6 1 1 1 1 6 1 1 1 6 1 1 1
symmnumber: 1
zpe: 656319.2 jmol-1
zpe.correction: 0.249979 hartree
zpe.thermalcorrener: 0.262962 hartree
zpe.thermalcorrenthalpy: 0.263906 hartree
zpe.thermalcorrgfe: 0.211420 hartree
zpe.sumelectzpe: -470.700574 hartree
zpe.sumelectthermal: -470.687591 hartree
zpe.sumelectthermalent: -470.686647 hartree
zpe.sumelectthermalfe: -470.739132 hartree
dipole: -12.2064 -11.0909 -2.6467
dipole: 16.7036
quadrupole: -126.9202 -110.5086 -89.6610
quadrupole: -29.1076 -5.5339 -6.4855
quadrupole: -17.8903 -1.4786 19.3689 -29.1076 -5.5339 -6.4855
hfenergy: -470.9505526 hartree
pointgroup: C01 [X(C10H17B1N1)]
dipole: -2.5406203 1.1059471 -0.8042138 debye
polarizability: 201.3720771|6.4415308|200.6762596|10.8088834|-19.1994867|144.4222176 unknown
InChI: InChI=1/C10H17BN/c1-11(2)9-7-5-6-8-10(9)12(3)4/h5-8,11H,1-4H3
charge -1 multiplicity 1
29 atoms
C  -0.45868529 0.70944291 0.66511246
C  0.87318238 1.06851924 0.87622982
C  1.43090878 2.30451184 0.51913354
C  0.51499534 3.2272122 -0.06569134
C  -0.82359486 2.87299991 -0.28316694
C  -1.31464947 1.61893373 0.06868668
H  -0.81178205 -0.27699247 0.95274404
H  1.52740667 0.32677778 1.3227129
H  -1.50753928 3.5863448 -0.72882936
H  -2.35564828 1.37171785 -0.11814741
N  0.95270439 4.52221431 -0.46845323
B  3.05769544 2.53891356 0.72511308
C  0.1528419 5.23140137 -1.43607674
H  -0.79058908 5.64110071 -1.02502928
H  0.73393163 6.07741971 -1.81687489
H  -0.09373878 4.58164348 -2.27884725
C  1.39161274 5.39544028 0.60195444
H  1.95935349 6.23342766 0.18276746
H  0.53600946 5.80958845 1.16870734
H  2.04163742 4.85040981 1.28330935
H  3.24318071 3.41253149 1.59167914
C  3.76838761 3.01043801 -0.68410507
H  3.3803909 3.95629565 -1.07870247
H  4.85687713 3.11989455 -0.56276638
H  3.61375069 2.25312488 -1.47019224
C  3.82019615 1.18535822 1.26962404
H  3.75096454 0.33997908 0.565131
H  4.89192038 1.39413656 1.39968783
H  3.45644631 0.82058793 2.24187735
