program: Gaussian 16
title: me_indenoPy_hydride
version: AS64L-G16RevC.02
method: RwB97XD
basis: GenECP
operation: Freq
keyword: #N
keyword: Geom=AllCheck
keyword: Guess=TCheck
keyword: SCRF=Check
keyword: GenChk
keyword: RwB97XD/GenECPFreq
converged: YES YES NO YES
title: Mulliken charges:
elementType: C C C C C C H H H C H H C C C C C H H H N B C H H H C H H H H
charge: 0.184523 -0.067321 0.057554 -0.032955 -0.374161 -0.256115 0.152670 0.193890 0.169521 -0.679152 0.191343 0.197041 -0.878868 0.231091 0.056979 0.419903 -0.521424 0.222692 0.220367 0.207519 0.116500 -0.150412 -0.592655 0.087670 0.111237 0.108276 -0.575550 0.101607 0.125597 0.103264 -0.130629
chargesum: -1.00000
title: Mulliken charges with hydrogens summed into heavy atoms:
elementType: C C C C C C C C C C C C N B C C
charge: 0.184523 -0.067321 0.057554 0.119715 -0.180271 -0.086594 -0.290768 -0.878868 0.231091 0.279670 0.640271 -0.313906 0.116500 -0.281042 -0.285472 -0.245082
1716.lowfreq: -25.3470 -23.0304 0.0003 0.0004 0.0005 11.5252 58.7180 77.1057 104.0675
frequency: 56.7136 75.6053 103.6168 128.7483 165.2210 234.6604 244.7520 251.7263 273.2131 280.5875 319.2444 330.2487 374.2858 412.9664 431.0345 477.1834 509.8111 542.3642 565.3783 571.1259 593.5804 648.0975 674.9372 731.1342 745.8362 754.4311 777.0254 781.4378 790.5764 803.8673 821.2848 859.8605 880.3008 902.8166 915.1928 940.8504 948.4663 983.0084 1000.3743 1002.4899 1016.5838 1041.9045 1078.8774 1087.5192 1108.5353 1127.2080 1133.5886 1166.6889 1177.4403 1198.0090 1209.7968 1226.8587 1251.7373 1279.0735 1289.4241 1304.5042 1321.8068 1334.3860 1367.4207 1439.4741 1449.3589 1457.1833 1471.0813 1484.5016 1491.7299 1498.1650 1503.5398 1512.3453 1621.6055 1639.2628 1653.0962 1675.8579 2283.2548 2957.9886 2972.4549 3012.5908 3027.2003 3031.7975 3042.8950 3078.6344 3079.8321 3150.3552 3155.3614 3173.5231 3175.1998 3187.5077 3205.5677
redmass: 3.4402 3.2069 4.0636 3.5997 3.9166 2.3222 3.7802 1.5602 1.9594 2.3951 1.0651 3.6913 2.3564 5.1072 3.7622 3.0716 3.7134 4.1906 3.4680 4.1082 3.2635 6.5275 4.7873 1.6209 3.6132 1.6834 1.3761 2.1986 1.4140 1.5591 3.4675 5.1408 1.4183 3.4692 1.5792 1.8273 1.6060 1.6243 1.4275 1.3229 1.7983 6.9959 2.2760 2.0573 1.9016 1.5749 1.4602 1.1407 1.5332 1.4263 2.4835 2.3635 3.3289 2.4068 1.2996 1.2770 2.4426 2.9328 3.4595 2.5504 1.8837 1.4566 1.0686 1.0583 1.1518 1.0917 2.1403 2.5590 6.5934 6.9825 6.6318 7.2698 1.0834 1.0391 1.0415 1.0950 1.0971 1.0965 1.0603 1.1023 1.0937 1.0893 1.0850 1.0919 1.0903 1.0947 1.0966
irintensity: 1.2635 2.1367 2.1618 2.4446 0.5804 6.1334 0.3479 1.6183 0.0185 3.3984 0.0695 0.3429 0.9334 5.1767 0.1039 1.2865 0.7397 0.6379 0.3639 0.7597 1.2492 6.9002 4.6035 5.7354 1.2477 1.7196 84.3433 24.5085 8.4167 1.7605 9.0195 10.6523 2.8906 30.3624 6.0855 3.6416 0.7872 0.8042 2.0679 1.5547 5.5812 6.7243 12.6876 84.6198 32.3985 54.4478 32.4335 0.0200 16.4226 0.1957 13.5357 13.2683 39.6263 7.3816 41.5574 35.7885 2.6187 3.5269 7.3749 8.9985 85.2214 37.1536 5.2989 1.7544 5.4542 11.6368 26.3721 3.3586 10.8110 58.3260 7.5112 110.4713 402.1344 99.3102 142.7527 109.3520 40.5746 238.3467 35.0847 13.1617 83.7650 43.4653 5.6663 39.3425 27.9544 76.5838 37.3156
temp: 298.150 k
press: 1.00000 atm
elementType: 6 6 6 6 6 6 1 1 1 6 1 1 6 6 6 6 6 1 1 1 7 5 6 1 1 1 6 1 1 1 1
symmnumber: 1
zpe: 664267.1 jmol-1
zpe.correction: 0.253006 hartree
zpe.thermalcorrener: 0.266506 hartree
zpe.thermalcorrenthalpy: 0.267450 hartree
zpe.thermalcorrgfe: 0.213525 hartree
zpe.sumelectzpe: -621.917137 hartree
zpe.sumelectthermal: -621.903637 hartree
zpe.sumelectthermalent: -621.902692 hartree
zpe.sumelectthermalfe: -621.956617 hartree
dipole: -18.2288 -8.5138 -9.0207
dipole: 22.0487
quadrupole: -173.3045 -117.1404 -123.5886
quadrupole: -31.0512 -31.3668 -11.4684
quadrupole: -35.2933 20.8707 14.4226 -31.0512 -31.3668 -11.4684
hfenergy: -622.1701426 hartree
pointgroup: C01 [X(C14H15B1N1)]
dipole: -2.7538909 -2.8213936 -2.666174 debye
polarizability: 228.7082002|-30.7551967|283.8744461|43.371885|34.2089448|182.4102081 unknown
InChI: InChI=1/C14H15BN/c1-15(2)12-7-3-5-10-9-11-6-4-8-16-14(11)13(10)12/h3-8,15H,9H2,1-2H3
charge -1 multiplicity 1
31 atoms
C  0.77017253 0.63907402 -0.42744511
C  1.99328498 0.61876971 0.26927065
C  2.49167734 1.74938535 0.96006522
C  1.65492902 2.878123 0.87635076
C  0.44048641 2.9052074 0.19394223
C  -0.02095489 1.77473606 -0.47196103
H  1.97341096 3.78798796 1.37510267
H  -0.14988642 3.81773902 0.18201511
H  -0.96476003 1.78136367 -1.00960674
C  0.47751293 -0.68817515 -1.08288362
H  0.37829219 -0.59419238 -2.1699933
H  -0.45263426 -1.13136078 -0.70989251
C  2.55615647 -0.74291495 0.09012816
C  1.67396708 -1.50755812 -0.70178993
C  3.99059919 -2.49655498 0.26344296
C  1.98887378 -2.81417005 -1.00756151
C  3.18699665 -3.32571952 -0.50877946
H  4.92840697 -2.87375554 0.66472659
H  1.32842586 -3.42614972 -1.61497326
H  3.49270551 -4.34543583 -0.71275659
N  3.69930859 -1.22990482 0.56892776
B  3.87284377 1.80471254 1.84304867
C  3.6853486 0.8619188 3.18072832
H  4.5921301 0.86401212 3.80453246
H  2.86354587 1.23233511 3.81537187
H  3.46746318 -0.18443218 2.93642895
C  4.25720433 3.33876098 2.30740988
H  3.52481274 3.7818007 3.00340432
H  5.22077229 3.34067885 2.8380143
H  4.363597 4.04159982 1.46630387
H  4.79759925 1.37306592 1.14420632
