program: Gaussian 16
title: me_indole_hydride
version: AS64L-G16RevC.02
method: RwB97XD
basis: GenECP
operation: Freq
keyword: #N
keyword: Geom=AllCheck
keyword: Guess=TCheck
keyword: SCRF=Check
keyword: GenChk
keyword: RwB97XD/GenECPFreq
converged: YES YES NO NO
title: Mulliken charges:
elementType: C C C C C C C C H H H N H B C H H H C H H H C H H H C H H H H
charge: -0.196923 0.584931 -1.295991 -1.191051 0.473478 -0.500588 -0.266880 0.994157 0.147377 0.162881 0.179768 0.310732 0.162301 0.193143 -0.495186 0.198432 0.141689 0.132815 -0.563314 0.075485 0.120775 0.099531 -0.584069 0.104435 0.099513 0.115056 -0.471971 0.162808 0.174037 0.154762 -0.222134
chargesum: -1.00000
title: Mulliken charges with hydrogens summed into heavy atoms:
elementType: C C C C C C C C N B C C C C
charge: -0.196923 0.747233 -1.295991 -1.043674 0.473478 -0.337707 -0.087112 0.994157 0.310732 -0.028991 -0.022250 -0.267523 -0.265064 0.019636
1716.lowfreq: -38.4118 -0.0007 -0.0005 -0.0003 9.5511 18.2617 41.4829 58.7995 78.5464
frequency: 35.5373 51.6225 78.2040 112.6803 134.6017 168.8324 183.3094 218.9924 235.0175 246.6538 260.5519 272.2577 310.0021 337.2631 374.3096 383.0543 445.3307 467.8066 546.4575 563.3996 595.5230 622.8897 680.6458 715.9979 744.9342 749.2960 758.9986 778.1509 795.8563 813.9945 823.8769 848.9107 865.0549 920.4541 947.6914 956.4904 965.8577 1008.0231 1022.2419 1061.5909 1064.1357 1116.7170 1127.7559 1152.0208 1156.4159 1162.8269 1191.8073 1229.7047 1262.0592 1290.9514 1301.8947 1324.3725 1346.9857 1379.7592 1412.7672 1422.4551 1451.6333 1468.8682 1476.7176 1483.7021 1484.7258 1486.7806 1489.0587 1502.3414 1506.4118 1525.8422 1533.0450 1538.8304 1633.2469 1677.9891 2210.6591 2971.9314 2975.6044 3017.9379 3028.9032 3030.5188 3033.6856 3040.9001 3045.5385 3075.7194 3089.3410 3114.5871 3155.5951 3171.5260 3172.6927 3179.8671 3241.4949
redmass: 1.4430 1.3463 3.3255 1.8291 3.2494 3.4014 1.9179 1.0664 1.0926 2.9605 2.3450 2.6255 3.4960 2.6553 3.1454 3.3369 3.1664 3.2713 3.1116 3.6202 4.9241 3.3169 2.7249 4.1171 1.7770 1.5565 1.3261 2.4795 1.6080 2.9202 1.6252 3.8870 1.4649 1.5390 2.1823 1.3269 2.5021 1.9183 1.5397 1.4990 1.6335 1.8805 1.8672 1.3233 1.3296 1.5832 1.6248 2.3770 2.2503 1.2762 1.2715 2.2438 3.6056 3.9466 1.2984 6.3736 1.2577 1.0543 1.0598 1.0592 1.0528 1.0574 1.1887 1.1216 1.0751 3.8518 3.8955 3.2398 6.7022 6.8021 1.0810 1.0366 1.0360 1.0416 1.0977 1.0370 1.0975 1.0988 1.0991 1.1014 1.1001 1.1013 1.0867 1.0915 1.0953 1.0945 1.0941
irintensity: 0.3404 0.7115 0.1376 0.5909 0.8185 1.6467 1.6899 0.0367 0.2218 2.1344 1.5196 4.9477 1.2456 2.6054 1.4953 2.9254 4.8846 4.4265 5.0997 5.2931 5.1045 12.0931 3.8231 2.8553 3.7003 19.5131 3.9240 0.1113 1.1358 1.2280 62.6974 0.1344 10.3599 5.0368 5.9672 1.0403 6.1870 13.2121 24.8472 2.3295 53.8210 45.0321 53.2034 8.8728 6.7461 130.6409 45.1287 12.5810 29.9724 41.1190 38.3998 41.1746 48.0837 3.8007 1.2068 59.6392 7.4633 0.9980 0.8386 0.4864 10.4186 2.0354 13.7403 6.1788 20.6662 170.1052 35.8637 23.4491 2.0309 5.4847 546.0738 96.4203 106.7418 93.5756 56.9019 103.1358 166.1688 111.0182 156.2877 46.8362 32.2197 30.7091 26.0723 32.0923 4.6275 42.5555 18.4619
temp: 298.150 k
press: 1.00000 atm
elementType: 6 6 6 6 6 6 6 6 1 1 1 7 1 5 6 1 1 1 6 1 1 1 6 1 1 1 6 1 1 1 1
symmnumber: 1
zpe: 687019.5 jmol-1
zpe.correction: 0.261672 hartree
zpe.thermalcorrener: 0.276196 hartree
zpe.thermalcorrenthalpy: 0.277140 hartree
zpe.thermalcorrgfe: 0.220468 hartree
zpe.sumelectzpe: -546.929499 hartree
zpe.sumelectthermal: -546.914974 hartree
zpe.sumelectthermalent: -546.914030 hartree
zpe.sumelectthermalfe: -546.970703 hartree
dipole: 5.3753 8.9507 0.6864
dipole: 10.4633
quadrupole: -108.1007 -125.3203 -99.9389
quadrupole: 4.2035 -0.2427 2.5993
quadrupole: 3.0193 -14.2004 11.1811 4.2035 -0.2427 2.5993
hfenergy: -547.1911707 hartree
pointgroup: C01 [X(C12H17B1N1)]
dipole: -1.3049472 3.6663928 0.2663712 debye
polarizability: 221.1115831|-41.5011973|259.2297295|28.557839|4.3421937|153.2055628 unknown
InChI: InChI=1/C12H17BN/c1-9-5-6-10-8-12(13(2)3)14(4)11(10)7-9/h5-8,13H,1-4H3
charge -1 multiplicity 1
31 atoms
C  -1.12195459 -1.29631595 -0.12988077
C  -2.407411 -1.28017883 -0.63281606
C  -1.88845541 0.84319638 0.00298249
C  -2.0366537 2.21298891 0.22721673
C  -3.23470489 2.82600414 -0.12463082
C  -4.26449667 2.0506692 -0.69051646
C  -4.11913206 0.68809505 -0.90970531
C  -2.91996371 0.05456887 -0.56381771
H  -1.23472332 2.79554242 0.67205432
H  -5.19852612 2.53780932 -0.95885887
H  -4.93440392 0.11791681 -1.34577139
N  -0.82299072 0.01466345 0.2476757
H  -2.92456789 -2.14763598 -1.01728457
B  -0.09208866 -2.53963238 0.05788365
C  0.42347989 0.46596873 0.81495722
H  0.32873056 0.66387987 1.8891051
H  1.17394547 -0.3072533 0.6628217
H  0.75536035 1.38342947 0.31807687
C  0.13811289 -2.85899156 1.65862412
H  0.54316231 -2.01288584 2.23209981
H  -0.80656037 -3.14330692 2.14746376
H  0.83548944 -3.69817439 1.80006574
C  -0.66795474 -3.86694595 -0.71201731
H  -1.62490404 -4.20727566 -0.2854881
H  -0.84205564 -3.69880277 -1.78387423
H  0.02865237 -4.71346431 -0.6294177
C  -3.4331409 4.30840649 0.08096896
H  -2.61417501 4.74060768 0.66158956
H  -3.47842618 4.84171105 -0.87492313
H  -4.36653555 4.51695893 0.61332186
H  0.99904778 -2.21327192 -0.44983716
