program: Gaussian 16
title: me_mequinolinamine_hydride
version: AS64L-G16RevC.02
method: RwB97XD
basis: GenECP
operation: Freq
keyword: #N
keyword: Geom=AllCheck
keyword: Guess=TCheck
keyword: SCRF=Check
keyword: GenChk
keyword: RwB97XD/GenECPFreq
converged: YES YES YES YES
title: Mulliken charges:
elementType: C C C C C H C H C C H H H N B C H H H C H H H C N H C H H H H
charge: -0.139553 0.061145 -1.953930 1.323381 -0.592008 0.164872 0.141469 0.137377 -0.593685 0.047191 0.190430 0.205860 0.210378 0.144199 -0.052580 -0.584232 0.103309 0.089184 0.106752 -0.577313 0.129217 0.103649 0.092764 0.237439 -0.174618 0.271051 -0.475354 0.167850 0.165710 0.174105 -0.124059
chargesum: -1.00000
title: Mulliken charges with hydrogens summed into heavy atoms:
elementType: C C C C C C C C N B C C C N C
charge: 0.025319 0.061145 -1.953930 1.323381 -0.454631 0.331899 -0.387825 0.257568 0.144199 -0.176639 -0.284987 -0.251682 0.237439 0.096433 0.032311
1716.lowfreq: -39.8099 -10.8646 -1.4740 -0.0006 -0.0006 -0.0002 42.5835 83.9684 122.6692
frequency: 30.8096 83.7915 121.3275 129.4739 146.5677 173.3613 175.4512 200.2744 230.3728 265.2988 278.6212 289.7512 316.1178 340.6898 370.4605 428.2877 443.7950 479.4697 497.2156 543.2279 570.3991 622.0065 625.4050 653.6635 676.3464 734.8412 749.8645 769.9772 786.9350 792.2778 810.1717 836.8809 859.5901 891.6100 915.2390 935.5974 953.0164 957.6978 991.3334 998.4536 1023.6760 1061.5801 1096.9483 1123.4075 1134.7911 1149.0712 1157.1011 1174.3803 1209.4095 1244.2640 1267.6001 1279.2115 1287.6030 1293.7344 1366.9247 1395.3054 1406.0119 1436.8838 1460.5340 1469.6570 1474.1670 1477.4073 1484.1807 1490.0713 1495.9947 1509.0835 1523.9274 1562.8968 1618.1300 1664.2260 1671.5468 2257.0404 2958.6946 2966.7900 3000.3100 3015.8822 3021.5721 3040.0502 3070.8026 3084.9490 3129.0490 3132.0230 3153.3119 3161.9089 3196.4463 3203.0133 3644.9847
redmass: 2.5036 3.2389 3.2565 2.6606 2.8773 1.4128 2.9678 2.3197 1.4296 1.5053 1.7417 2.1386 3.4458 2.9073 2.8016 4.7798 3.9072 2.3619 3.0459 3.8263 3.5859 2.8746 4.2483 3.1163 2.4495 1.7939 1.3428 2.9102 1.4232 1.5759 2.4456 2.2813 3.0361 1.6164 2.2881 2.9395 1.8155 1.4395 1.3410 2.7713 2.2221 2.3958 1.8630 1.6487 1.6902 1.3379 1.3395 1.7060 2.3404 1.7509 1.9917 1.3691 2.0073 1.2939 2.3737 5.9125 2.2812 2.6186 1.0625 1.3582 1.0571 1.0613 1.4586 1.2168 1.0526 2.6699 1.1323 2.2838 6.6685 5.4695 6.5329 1.0837 1.0416 1.0406 1.0491 1.0929 1.0963 1.0967 1.0946 1.0877 1.1017 1.0888 1.0903 1.0886 1.0969 1.0873 1.0758
irintensity: 0.8093 4.4016 0.9316 1.8163 1.3175 1.4461 2.0124 2.9598 2.5458 0.7758 0.8761 3.2907 0.3441 5.6860 9.8532 18.6409 4.7191 121.7624 4.3436 3.6144 32.2965 26.0755 14.0963 29.6411 2.6025 2.0063 0.8449 6.3376 3.6069 1.9724 36.4000 49.2912 4.8244 25.7831 12.0405 30.7952 7.4650 1.0336 1.1168 14.4978 4.1315 0.5249 5.2868 89.3318 67.2796 19.3249 34.2596 9.8715 39.1999 36.8420 17.2014 84.7162 55.2431 28.8660 41.9217 19.2091 28.1759 114.8994 1.0980 2.2502 2.2130 0.9786 2.8061 17.2240 3.6268 97.5363 96.9819 14.6414 42.3914 297.9212 24.7334 465.6328 91.5479 135.4920 108.9295 113.8213 169.1909 114.6406 75.5002 45.1159 41.9118 56.0640 30.9484 33.6042 56.4885 16.6528 12.6838
temp: 298.150 k
press: 1.00000 atm
elementType: 6 6 6 6 6 1 6 1 6 6 1 1 1 7 5 6 1 1 1 6 1 1 1 6 7 1 6 1 1 1 1
symmnumber: 1
zpe: 674228.6 jmol-1
zpe.correction: 0.256800 hartree
zpe.thermalcorrener: 0.271299 hartree
zpe.thermalcorrenthalpy: 0.272243 hartree
zpe.thermalcorrgfe: 0.215970 hartree
zpe.sumelectzpe: -601.057477 hartree
zpe.sumelectthermal: -601.042979 hartree
zpe.sumelectthermalent: -601.042034 hartree
zpe.sumelectthermalfe: -601.098308 hartree
dipole: 6.4356 5.3611 -0.4463
dipole: 8.3880
quadrupole: -98.9155 -107.3763 -105.6144
quadrupole: -9.8423 4.3798 -1.0166
quadrupole: 5.0532 -3.4076 -1.6457 -9.8423 4.3798 -1.0166
hfenergy: -601.3142773 hartree
pointgroup: C01 [X(C12H16B1N2)]
dipole: -2.9634181 3.5645373 -0.0399498 debye
polarizability: 279.2980539|26.9949438|252.9410038|5.7638344|7.6489956|139.2222655 unknown
InChI: InChI=1/C12H16BN2/c1-13(2)11-8-10(14-3)7-9-5-4-6-15-12(9)11/h4-8,13-14H,1-3H3
charge -1 multiplicity 1
31 atoms
C  -3.98580922 -0.06117522 -0.04440019
C  -2.60512331 -0.03501835 -0.0632386
C  -2.00073345 1.27105744 0.03745315
C  -2.81633058 2.43948736 0.1454303
C  -4.22405973 2.33151415 0.15212926
H  -4.47324475 -1.02605399 -0.11944676
C  -2.17060979 3.69605671 0.23778055
H  -4.82866396 3.23172477 0.23489924
C  -0.80453982 3.76144131 0.22021913
C  -0.08262816 2.55438722 0.10638464
H  -2.77301221 4.59698576 0.32062059
H  -0.27921985 4.70786688 0.28911707
H  1.00610071 2.57919085 0.08725519
N  -0.64187362 1.37296022 0.01833445
B  -1.73531365 -1.42203823 -0.18254252
C  -0.88372176 -1.67603581 1.20311122
H  -1.55529715 -1.76899624 2.07226327
H  -0.3041476 -2.61067392 1.15137538
H  -0.17801903 -0.86531083 1.41995656
C  -2.6952387 -2.7281968 -0.47444938
H  -2.07768426 -3.62850352 -0.60364839
H  -3.3842153 -2.94545979 0.35941631
H  -3.31223298 -2.63905814 -1.38208664
C  -4.81289641 1.09007701 0.05862748
N  -6.2046408 0.96714167 0.09770774
H  -6.67673412 1.82359147 -0.14598764
C  -6.85698449 -0.21641877 -0.4282106
H  -6.67708997 -1.07933884 0.21772576
H  -7.93374288 -0.03903573 -0.44704157
H  -6.52574667 -0.47751103 -1.44306016
H  -0.95236251 -1.29000061 -1.13535481
