program: Gaussian 16
title: MeQHBMe2 + H-
version: ES64L-G16RevC.01
method: RwB97XD
basis: GenECP
operation: Freq
keyword: #N
keyword: Geom=AllCheck
keyword: Guess=TCheck
keyword: SCRF=Check
keyword: GenChk
keyword: RwB97XD/GenECPFreq
converged: YES YES YES YES
title: Mulliken charges:
elementType: C H C N N N B C H H H H C H H H C H H H
charge: -0.692460 0.198346 -0.096696 0.319684 -0.167605 -0.150264 0.041309 -0.399446 0.173464 0.181789 0.183684 -0.179388 -0.521325 0.106200 0.097740 0.106574 -0.517639 0.106969 0.108533 0.100531
chargesum: -1.00000
title: Mulliken charges with hydrogens summed into heavy atoms:
elementType: C C N N N B C C C
charge: -0.494114 -0.096696 0.319684 -0.167605 -0.150264 -0.138079 0.139492 -0.210811 -0.201606
1716.lowfreq: -39.4463 0.0007 0.0008 0.0009 29.2529 49.1340 55.0857 90.1938 116.4470
frequency: 34.6942 87.5122 115.5142 142.8068 214.2974 233.4027 246.4451 257.7752 353.6516 392.4989 416.3195 541.3491 669.5310 714.6641 726.8848 745.8791 764.3321 789.8363 806.7024 891.4730 940.2617 997.9929 1025.2100 1060.5205 1072.6722 1094.3308 1120.1478 1149.7312 1161.4630 1267.8494 1278.2667 1291.2619 1300.5493 1367.3390 1449.0496 1465.1701 1467.2706 1472.0342 1477.7963 1488.6264 1489.7527 1520.0687 1552.1216 2286.5959 2958.5082 2960.7484 3015.3514 3018.8398 3035.6032 3040.6292 3054.0448 3125.3198 3167.4388 3269.5953
redmass: 3.0601 1.7418 1.6539 2.7098 2.5048 1.1765 1.7960 1.1407 2.5875 4.4215 3.3065 2.3374 3.7645 2.2919 1.5858 2.6915 2.3051 1.4120 1.8849 1.4175 1.9524 2.0076 3.5751 2.1055 2.9130 1.6956 1.6078 1.3305 2.0023 8.9182 1.2887 1.3459 3.9976 5.4482 1.3803 2.2665 1.0575 1.0775 1.1092 1.0543 1.0428 1.2652 5.3745 1.0821 1.0407 1.0395 1.0943 1.0912 1.0998 1.0988 1.0346 1.1051 1.1021 1.0983
irintensity: 3.7487 0.0856 1.6756 4.1630 0.3901 0.2075 0.2352 0.1920 1.7994 0.7198 1.6938 2.0809 1.1310 2.7131 2.0893 5.6576 4.7911 3.8282 29.6822 2.9182 6.8294 13.3906 18.5653 56.1007 26.1300 74.9328 47.8239 2.6101 63.5421 61.7526 30.8057 30.7324 14.3752 28.5996 10.6994 15.2971 0.0693 1.0821 6.9695 4.5232 12.1899 15.3701 10.4683 520.7828 89.1437 116.9108 55.9870 215.5782 101.0947 151.2761 72.8160 23.7668 7.1694 2.0859
temp: 298.150 k
press: 1.00000 atm
elementType: 6 1 6 7 7 7 5 6 1 1 1 1 6 1 1 1 6 1 1 1
symmnumber: 1
zpe: 428189.7 jmol-1
zpe.correction: 0.163089 hartree
zpe.thermalcorrener: 0.173187 hartree
zpe.thermalcorrenthalpy: 0.174131 hartree
zpe.thermalcorrgfe: 0.127337 hartree
zpe.sumelectzpe: -386.135639 hartree
zpe.sumelectthermal: -386.125541 hartree
zpe.sumelectthermalent: -386.124597 hartree
zpe.sumelectthermalfe: -386.171391 hartree
dipole: -16.0249 5.8902 -5.0905
dipole: 17.8159
quadrupole: -128.6759 -53.4621 -77.8159
quadrupole: 18.1819 -23.6709 5.4795
quadrupole: -42.0246 33.1892 8.8353 18.1819 -23.6709 5.4795
hfenergy: -386.2987279 hartree
pointgroup: C01 [X(C5H11B1N3)]
dipole: -0.6727017 4.0069583 -0.4549086 debye
dipolederiv: -0.1079625 -0.2111687 0.0281214 0.1354264 0.0897911 0.1143978 0.0352707 -0.1895327 -0.1212802 0.0971306 -0.0623425 -0.0829827 -0.0684504 0.0352409 -0.0567128 -0.0820249 -0.0493544 0.1311967 -0.0808294 -0.2099571 0.0723423 -0.2697628 -0.061875 -0.2234766 0.0681298 -0.1641836 -0.1375927 0.0336258 0.1373182 0.1100999 0.2079775 -0.9414584 0.1425876 0.0851719 0.1577899 -0.0116284 -0.5697461 0.1470325 -0.3030948 0.2430866 0.4685262 0.2056753 -0.2994379 0.1268306 -0.4370716 -0.1172101 0.2887076 0.1754802 -0.1016675 -0.5984637 -0.0882295 0.1712563 0.2364807 -0.1673263 0.6170548 0.0149029 -0.0311235 -0.0085255 0.7336531 -0.0042654 -0.0273582 0.0097484 0.6512559 0.2526437 -0.1358797 -0.0528396 -0.1404925 0.6870165 -0.0741155 -0.0422882 -0.1202744 0.2547642 -0.0533146 -0.1188765 0.0710666 0.0019959 -0.093596 0.0465971 0.03811 0.0632089 0.0685143 0.0168192 0.0627767 -0.0889966 -0.029732 0.0538451 -0.0408223 -0.0956303 0.0530493 0.0073151 0.0431648 0.0894545 0.0486284 0.0636792 -0.0984431 0.0058362 0.091996 -0.1128816 -0.0656583 -0.2682461 -0.14331 -0.0272354 -0.0978113 -0.6542322 -0.0680253 -0.029363 -0.1080613 -0.2513675 -0.0021343 0.0527081 0.0177791 0.0528188 0.027966 -0.0542232 0.0485423 -0.0164828 -0.4722458 -0.0917397 0.1461461 -0.1737081 0.1386667 -0.0909523 0.1679126 -0.1425636 0.1504733 -0.0895224 0.0211757 -0.0907076 -0.0415961 -0.0941128 -0.2826909 -0.1622022 -0.0154029 -0.087484 0.010876 -0.2532773 -0.0469462 0.1954414 -0.0415033 0.038965 0.0256252 0.1303754 0.0079268 -0.0147518 -0.4117727 0.0069349 0.1697643 -0.0253268 0.0247813 0.0615031 0.135298 0.0526857 -0.0569484 -0.1710615 0.1906894 -0.1173658 0.2090093 -0.1033832 0.0928551 -0.1432363 0.1004971 -0.0016399 0.0570402 -0.0073418 0.0405964 0.0091006 0.0385689 -0.0403366 0.1111089 -0.0423193 -0.3301834 -0.0113606 -0.1101408 -0.0103774 -0.1843761 -0.2732595 -0.0505806 -0.0379541 -0.0681166 0.0332944 unknown
polarizability: 120.2178491|-8.0922248|134.2633798|15.261438|-5.1553356|113.1342293 unknown
InChI: InChI=1/C5H11BN3/c1-6(2)5-4-9(3)8-7-5/h4,6H,1-3H3
charge -1 multiplicity 1
20 atoms
C  3.00782913 1.77306678 0.87665394
H  3.64720085 2.46058799 1.40768744
C  2.97710178 0.39082153 0.82978596
N  2.01373134 2.20842474 0.06786107
N  1.37166713 1.16886252 -0.47002438
N  1.94045939 0.08414958 -0.02013759
B  3.95691693 -0.66668413 1.58236491
C  1.59391384 3.56042177 -0.21632785
H  2.44270459 4.15636013 -0.55725813
H  0.84388851 3.51541199 -1.00475622
H  1.15807698 4.02557079 0.6709626
H  3.57539762 -1.81040894 1.300584
C  3.87235305 -0.43781586 3.2118955
H  4.5381863 -1.12246105 3.75834959
H  4.16680253 0.58414698 3.50449823
H  2.8581552 -0.59715712 3.60597334
C  5.50093255 -0.45460175 1.04658703
H  6.19986797 -1.16112704 1.51913032
H  5.59194333 -0.5932155 -0.04085134
H  5.88074105 0.55731416 1.26724156
