program: Gaussian 16
title: me_naphthalene_hydride
version: AS64L-G16RevC.02
method: RwB97XD
basis: GenECP
operation: Freq
keyword: #N
keyword: Geom=AllCheck
keyword: Guess=TCheck
keyword: SCRF=Check
keyword: GenChk
keyword: RwB97XD/GenECPFreq
converged: YES YES YES YES
title: Mulliken charges:
elementType: C C C C C C H C C H H C C H H H B C H H H C H H H N C H H H C H H H H
charge: -0.245838 -0.076598 -0.234157 0.474611 -0.275453 -0.566556 0.149640 0.156242 -0.262284 0.149317 0.200143 -0.567169 -0.085233 0.161680 0.191934 0.151383 -0.104947 -0.598133 0.125524 0.109057 0.106362 -0.630555 0.113937 0.094947 0.104439 0.271040 -0.444349 0.119551 0.176650 0.174032 -0.321892 0.178226 0.123201 0.164986 -0.083738
chargesum: -1.00000
title: Mulliken charges with hydrogens summed into heavy atoms:
elementType: C C C C C C C C C C B C C N C C
charge: -0.096199 -0.076598 -0.234157 0.474611 -0.126137 -0.366413 0.156242 -0.100604 -0.375235 0.066151 -0.188685 -0.257189 -0.317233 0.271040 0.025884 0.144520
1716.lowfreq: -11.8329 0.0001 0.0002 0.0004 21.5223 35.5861 66.1649 99.2293 126.0195
frequency: 63.8430 98.9182 125.3264 133.2269 159.4762 181.6264 189.6053 209.9140 233.3231 274.6242 278.2663 294.1129 304.9106 319.4871 339.6363 349.2907 374.0910 413.7336 463.6220 494.6373 504.5024 519.8698 541.1475 554.4661 615.1683 635.7487 693.3275 722.6286 742.4052 764.7913 776.5234 794.7567 797.3552 803.0917 847.3874 886.3754 895.6612 903.0943 920.5944 956.8776 986.0112 990.2879 998.2052 1012.2853 1058.0622 1075.7494 1092.6391 1116.9729 1117.7034 1130.4502 1165.9338 1171.4189 1187.3737 1205.4114 1220.6466 1229.9553 1242.2414 1277.6146 1279.6922 1288.7110 1335.0926 1379.6592 1383.8002 1404.5792 1443.6785 1458.4502 1463.9621 1469.8589 1477.9353 1479.3895 1483.4097 1486.8249 1490.3647 1493.7018 1501.9166 1521.6147 1553.4506 1622.1963 1658.7425 1672.0329 2342.4109 2911.2571 2923.1287 2960.6909 2969.8712 3016.5549 3022.1997 3033.3737 3060.2852 3066.5216 3091.0544 3120.8669 3154.0446 3164.9458 3166.9956 3176.2173 3185.7619 3197.6825 3212.2411
redmass: 3.6442 2.7140 3.0890 2.8678 3.6320 1.4274 1.7403 3.2339 3.1227 1.2264 2.1372 1.5312 1.1573 1.7795 2.5589 2.6621 3.1032 2.8945 3.6169 3.4950 3.8073 3.8093 3.2787 5.7519 4.1933 3.1189 2.9210 1.8423 1.5363 1.4105 2.5073 1.5998 1.4254 3.8456 3.2391 1.6759 1.7658 2.6750 1.5635 2.3912 1.3904 2.3107 1.3463 2.5435 3.7277 1.6301 1.4005 1.3952 2.0627 1.7526 1.4228 1.4149 1.2628 1.3679 1.7514 1.7018 1.9192 1.2673 3.7129 1.3012 2.5184 2.4751 5.4781 3.3147 1.1673 1.7689 1.0749 1.4786 1.0621 1.1042 1.0536 1.1877 1.1216 1.1113 1.2526 1.2096 4.0624 5.8586 5.7660 6.1048 1.0795 1.0612 1.0616 1.0377 1.0390 1.0974 1.0975 1.0969 1.0949 1.0701 1.0757 1.1029 1.0850 1.0855 1.0981 1.0950 1.0952 1.0911 1.0920
irintensity: 2.6825 0.6275 2.5497 1.0357 4.5347 2.3825 2.7332 0.4830 2.8134 2.0306 0.8301 1.0491 0.2481 0.8373 1.7516 0.5008 6.3226 2.8495 8.0337 2.6938 4.0121 0.1816 1.9671 1.3697 7.5643 10.7867 11.7633 3.8339 2.5363 4.5319 4.4090 18.7986 80.8522 9.1815 21.2700 5.4350 6.1572 18.7511 5.8019 16.1111 1.1868 11.5051 0.9850 42.0647 45.8332 58.9574 5.4714 34.0388 10.6599 12.1133 17.8388 48.5223 4.7071 53.2130 68.1583 11.8099 6.7047 29.7212 25.2070 40.7236 21.1841 24.6387 17.7390 63.2403 0.5126 29.1618 1.3359 8.3019 1.1614 8.6209 6.6677 6.3314 6.1145 32.4684 16.4318 44.0745 16.9169 170.7051 11.2291 14.2232 440.6285 125.6318 296.2063 86.7945 120.4751 39.4325 127.5988 198.5049 100.6270 58.8623 52.9652 29.7554 13.1180 2.7634 7.2947 48.8924 75.2751 45.1497 25.8935
temp: 298.150 k
press: 1.00000 atm
elementType: 6 6 6 6 6 6 1 6 6 1 1 6 6 1 1 1 5 6 1 1 1 6 1 1 1 7 6 1 1 1 6 1 1 1 1
symmnumber: 1
zpe: 781051.3 jmol-1
zpe.correction: 0.297487 hartree
zpe.thermalcorrener: 0.312778 hartree
zpe.thermalcorrenthalpy: 0.313722 hartree
zpe.thermalcorrgfe: 0.257040 hartree
zpe.sumelectzpe: -624.267041 hartree
zpe.sumelectthermal: -624.251749 hartree
zpe.sumelectthermalent: -624.250805 hartree
zpe.sumelectthermalfe: -624.307487 hartree
dipole: 7.2994 3.5458 2.5477
dipole: 8.5056
quadrupole: -127.4496 -113.8652 -114.1039
quadrupole: 2.4112 -1.9589 -6.4616
quadrupole: -8.9767 4.6077 4.3690 2.4112 -1.9589 -6.4616
hfenergy: -624.5645275 hartree
pointgroup: C01 [X(C14H19B1N1)]
dipole: -2.6839331 0.8902634 1.2313273 debye
polarizability: 283.8587823|4.0905428|273.7854667|-9.3252854|-13.1788625|168.8447427 unknown
InChI: InChI=1/C14H19BN/c1-15(2)12-9-5-7-11-8-6-10-13(14(11)12)16(3)4/h5-10,15H,1-4H3
charge -1 multiplicity 1
35 atoms
C  -5.46742516 -0.4578291 0.33413532
C  -4.11988178 -0.73758064 0.46395252
C  -3.13388035 0.28679633 0.19102171
C  -3.6344501 1.62071329 0.06307371
C  -5.03142611 1.87317246 -0.0203345
C  -5.92506217 0.84563152 0.05700742
H  -6.19878897 -1.23725635 0.50946185
C  -1.71843588 0.02040323 0.0067719
C  -2.73158146 2.71029152 -0.01759988
H  -5.36769311 2.89566316 -0.16563183
H  -6.99106906 1.02975924 -0.03489409
C  -1.38678061 2.47253548 -0.01764327
C  -0.90946899 1.1463955 -0.04176217
H  -3.12924551 3.71905298 -0.08365529
H  -0.68295155 3.29974589 -0.05912013
H  0.15926225 1.00869265 -0.16137438
B  -1.03437013 -1.43470576 -0.42225998
C  0.57064119 -1.28284749 -0.77088855
H  0.97547977 -2.26769051 -1.04644169
H  0.77368391 -0.61272509 -1.6227974
H  1.18183679 -0.92468894 0.07212731
C  -1.81179596 -1.96761702 -1.77573319
H  -1.72474837 -1.24439177 -2.60260355
H  -1.37724629 -2.91210019 -2.13678702
H  -2.88255359 -2.1461787 -1.61635041
N  -3.69899176 -2.00154292 0.90509982
C  -3.02801123 -2.01015687 2.19056098
H  -3.75307895 -1.91437647 3.02058105
H  -2.47431862 -2.94479956 2.3084199
H  -2.31128256 -1.19406579 2.24720239
C  -4.60532601 -3.10999109 0.753179
H  -4.04850123 -4.03798302 0.91062497
H  -5.44798127 -3.09963792 1.47105499
H  -5.01283509 -3.12781586 -0.26012134
H  -1.12251704 -2.28228419 0.46596185
