program: Gaussian 16
title: me_phquinolinamine_hydride
version: AS64L-G16RevC.02
method: RwB97XD
basis: GenECP
operation: Freq
keyword: #N
keyword: Geom=AllCheck
keyword: Guess=TCheck
keyword: SCRF=Check
keyword: GenChk
keyword: RwB97XD/GenECPFreq
converged: YES YES YES YES
title: Mulliken charges:
elementType: C C C C C H C H C C H H H N B C H H H C H H H C N H C C C C H C H C H H H H
charge: -0.496332 0.062552 -2.088797 1.157214 -0.324981 0.184985 0.065381 0.153966 -0.509054 0.037161 0.192329 0.215581 0.216886 0.157354 0.022520 -0.635285 0.104605 0.093678 0.108266 -0.583613 0.131187 0.104146 0.081657 0.672205 -0.043907 0.300782 -0.150580 -0.717857 0.460480 -0.385783 0.188707 -0.224041 0.245808 -0.300266 0.205116 0.226998 0.190523 -0.119592
chargesum: -1.00000
title: Mulliken charges with hydrogens summed into heavy atoms:
elementType: C C C C C C C C N B C C C N C C C C C C
charge: -0.311347 0.062552 -2.088797 1.157214 -0.171015 0.257711 -0.293474 0.254047 0.157354 -0.097072 -0.328736 -0.266623 0.672205 0.256875 -0.150580 -0.529149 0.706289 -0.180667 0.002957 -0.109743
1716.lowfreq: -36.8319 -4.4957 -0.0005 -0.0005 -0.0004 11.2408 34.9139 49.0218 58.6252
frequency: 24.1199 48.1103 57.3733 66.8913 109.5337 137.8756 150.3533 191.7023 197.7751 242.7653 262.4479 276.7909 289.5609 298.4683 316.8345 336.3419 350.6160 386.5194 430.1566 446.4868 461.1189 488.0319 519.4243 538.5523 552.1049 565.4734 598.4774 634.1305 644.2996 660.9126 698.5546 715.5378 744.6396 759.4477 768.5145 782.8877 796.8278 805.2934 816.4873 843.7145 848.9258 859.9780 869.5682 904.3303 909.4671 934.6473 959.7888 968.4721 974.6332 991.4495 999.4641 1001.6831 1010.2052 1014.6894 1027.9263 1060.2637 1068.1166 1115.2627 1117.8092 1125.7591 1152.3437 1179.4099 1190.4680 1209.5301 1241.5446 1263.2997 1280.5308 1289.9822 1294.3586 1299.3119 1337.5836 1359.5784 1373.2015 1396.6227 1412.2701 1435.6160 1471.0773 1472.2778 1479.7906 1488.0460 1503.7827 1508.6586 1520.7428 1539.2462 1569.7446 1622.1856 1652.8895 1667.4625 1673.3331 1682.0659 2277.0076 2960.7411 2971.6217 3014.7056 3025.4035 3032.6242 3072.0795 3144.0004 3164.1360 3167.0070 3172.0074 3184.8925 3192.2326 3196.9633 3200.1930 3209.4871 3223.1991 3657.7806
redmass: 4.8625 3.9901 3.7811 4.1493 3.1066 4.5554 4.4078 3.6025 3.9269 1.7019 1.8410 2.7094 3.2009 1.6497 2.2604 2.2125 2.4226 1.4756 2.9781 3.8095 4.0234 3.6564 2.9093 3.9678 5.5197 4.9131 3.5453 6.3220 6.0921 3.7354 3.1569 1.9147 1.6950 1.3895 1.8924 1.8149 1.4380 2.0140 3.6341 1.9980 1.5716 3.0397 2.7829 1.9084 1.5320 1.7406 2.0682 1.3670 2.3343 1.3397 1.3530 1.9418 1.4197 4.0161 3.2470 2.1106 2.2566 1.5802 1.5489 2.0345 1.3792 1.1121 1.6518 1.1209 2.5509 2.4448 1.8683 1.5354 1.2715 1.5848 3.0525 1.9024 2.6759 4.2044 2.1301 3.2434 1.7782 1.1167 1.0742 1.0784 2.3287 1.0935 2.8966 2.4087 2.6495 6.4263 5.5621 5.4050 6.0187 6.1410 1.0838 1.0376 1.0404 1.0973 1.0956 1.0975 1.0953 1.0884 1.0912 1.0891 1.0866 1.0880 1.0935 1.0886 1.0972 1.0971 1.0942 1.0759
irintensity: 0.3181 0.3850 1.5151 1.0337 0.7169 1.8812 0.8784 1.0845 1.8514 4.3674 5.2300 1.3273 0.9444 2.0978 3.3575 6.2126 13.6674 194.5460 0.3367 0.5001 3.8250 8.8779 16.5035 1.3770 2.6082 0.4126 2.8911 2.5788 4.7827 5.8153 9.2673 48.1182 3.9346 0.6116 67.3768 4.4877 7.3559 29.2980 9.0789 13.3203 18.5017 7.7103 9.1162 22.5153 8.6774 15.1648 17.2808 0.6191 12.2325 0.1727 1.3366 7.6441 2.7331 7.0518 15.7089 13.1430 8.4395 39.8446 26.5691 85.9191 28.1803 3.4780 10.1311 16.3101 6.5924 21.3580 10.2498 116.3922 19.2422 31.7380 159.9243 5.3371 102.8336 16.7348 64.1298 197.5640 1.3313 3.8742 8.6390 3.8438 32.7551 3.2820 109.8501 249.0156 142.9730 40.5300 10.8589 519.0970 6.9229 26.9154 449.9924 87.0225 135.0760 99.0063 77.7864 199.6901 85.5239 54.8454 11.6407 39.0211 13.3500 0.4198 35.3302 27.8928 48.6311 29.3278 2.0925 24.1550
temp: 298.150 k
press: 1.00000 atm
elementType: 6 6 6 6 6 1 6 1 6 6 1 1 1 7 5 6 1 1 1 6 1 1 1 6 7 1 6 6 6 6 1 6 1 6 1 1 1 1
symmnumber: 1
zpe: 814720.5 jmol-1
zpe.correction: 0.310311 hartree
zpe.thermalcorrener: 0.327698 hartree
zpe.thermalcorrenthalpy: 0.328642 hartree
zpe.thermalcorrgfe: 0.264818 hartree
zpe.sumelectzpe: -792.724617 hartree
zpe.sumelectthermal: -792.707229 hartree
zpe.sumelectthermalent: -792.706285 hartree
zpe.sumelectthermalfe: -792.770110 hartree
dipole: 8.8380 6.9488 0.9211
dipole: 11.2803
quadrupole: -152.6565 -134.1299 -131.3017
quadrupole: -16.1428 -8.8988 4.2910
quadrupole: -13.2938 5.2328 8.0610 -16.1428 -8.8988 4.2910
hfenergy: -793.0349273 hartree
pointgroup: C01 [X(C17H18B1N2)]
dipole: -4.3408431 3.3477745 -0.0696699 debye
polarizability: 384.1346345|56.1392831|305.1416527|8.8898448|29.4266777|199.4091295 unknown
InChI: InChI=1/C17H18BN2/c1-18(2)16-12-15(20-14-8-4-3-5-9-14)11-13-7-6-10-19-17(13)16/h3-12,18,20H,1-2H3
charge -1 multiplicity 1
38 atoms
C  -3.94837475 -0.18274306 0.13795726
C  -2.57979344 -0.10577425 -0.01450135
C  -2.02521451 1.22720496 -0.01896869
C  -2.86863807 2.36790188 0.13671806
C  -4.26977819 2.20670813 0.2608543
H  -4.41347579 -1.16147626 0.18563838
C  -2.27133331 3.64956978 0.13897092
H  -4.90640407 3.08327938 0.34775704
C  -0.91647028 3.7652913 -0.00844968
C  -0.16281371 2.5821927 -0.16049277
H  -2.89975581 4.52847825 0.25536757
H  -0.42376789 4.73123633 -0.01229543
H  0.91711394 2.64794575 -0.28437707
N  -0.67785949 1.37780777 -0.1664922
B  -1.66325305 -1.45977568 -0.12651205
C  -0.73906807 -1.61006764 1.22767124
H  -1.36124467 -1.68486893 2.13489631
H  -0.1183538 -2.51835676 1.19326658
H  -0.06336853 -0.75699631 1.36455309
C  -2.58426916 -2.80709534 -0.33392175
H  -1.94139614 -3.68673189 -0.47896244
H  -3.22556794 -3.0363447 0.53344824
H  -3.24659004 -2.75688821 -1.21248253
C  -4.80216332 0.94383079 0.25706316
N  -6.18895445 0.76173133 0.44211768
H  -6.65404006 1.51406143 0.92402835
C  -7.02507496 -0.02619052 -0.34364965
C  -8.37732864 -0.13092358 0.01771242
C  -6.58593292 -0.70981782 -1.48474172
C  -9.25699538 -0.89238114 -0.73556037
H  -8.73000273 0.38708335 0.90459646
C  -7.47564528 -1.47998012 -2.22284517
H  -5.55159555 -0.63749184 -1.79495761
C  -8.81439856 -1.58134636 -1.86160133
H  -10.29699692 -0.95556667 -0.43248511
H  -7.10940564 -2.00370314 -3.09952066
H  -9.5000402 -2.18508742 -2.44471704
H  -0.92758063 -1.32958747 -1.11492249
