program: Gaussian 16
title: me_quinoline_hydride
version: AS64L-G16RevC.02
method: RwB97XD
basis: GenECP
operation: Freq
keyword: #N
keyword: Geom=AllCheck
keyword: Guess=TCheck
keyword: SCRF=Check
keyword: GenChk
keyword: RwB97XD/GenECPFreq
converged: YES YES YES YES
title: Mulliken charges:
elementType: C C C C C C H H H B N C C H C H H H C H H H C H H H
charge: -1.578511 0.010141 0.002365 -0.456899 -0.280646 0.703379 0.149672 0.199592 0.150720 -0.024376 0.124173 0.674902 -0.729086 0.202460 0.092053 0.217289 0.210214 -0.137332 -0.564710 0.095806 0.126153 0.097568 -0.579999 0.103478 0.089717 0.101877
chargesum: -1.00000
title: Mulliken charges with hydrogens summed into heavy atoms:
elementType: C C C C C C B N C C C C C
charge: -1.578511 0.010141 0.152037 -0.257307 -0.129926 0.703379 -0.161708 0.124173 0.885116 -0.526625 0.309342 -0.245183 -0.284928
1716.lowfreq: -12.1151 0.0004 0.0004 0.0004 21.7448 29.4752 81.2136 90.9722 167.6350
frequency: 80.3284 90.0939 167.3914 171.0713 187.6305 231.2992 268.7935 289.0156 312.8089 349.2594 432.4538 442.9294 478.3101 490.6274 547.0524 563.9004 586.1663 663.9657 668.6196 744.9009 754.0277 759.5297 790.8842 816.3492 825.4690 838.5213 849.8572 893.7374 920.9899 944.0486 969.8208 988.7894 994.4642 1001.3791 1019.1596 1053.4264 1091.0943 1107.7583 1123.3459 1152.8676 1177.2507 1224.9539 1257.9209 1275.1361 1283.2841 1302.1546 1339.6547 1398.3314 1413.9264 1455.8672 1469.8891 1474.7923 1488.5393 1492.0791 1498.0759 1544.0944 1618.6660 1658.7670 1679.5874 2259.8197 2960.0856 2965.2580 3015.5365 3017.3060 3038.1099 3073.9525 3130.6792 3154.9496 3166.2071 3174.3397 3186.6807 3201.7891
redmass: 3.0637 3.2619 3.5142 3.8654 2.9761 1.2256 1.0942 2.6012 3.1713 2.2064 3.8645 4.1517 3.3215 3.2303 6.1701 5.2572 3.1171 4.4044 3.7385 1.1231 2.5267 1.1861 1.4526 1.7763 3.8002 2.8546 4.2476 1.5315 1.6784 1.7137 1.4077 2.1349 1.5851 1.3456 1.9823 2.7409 1.7758 1.9494 1.9009 1.2950 1.3982 2.1608 2.2638 1.6622 1.2634 1.2668 2.8063 5.3818 1.9163 2.0598 1.0560 1.0613 1.1296 1.0554 2.2868 3.7812 6.8389 5.4895 6.6910 1.0828 1.0401 1.0402 1.0953 1.0958 1.0984 1.0934 1.0889 1.0848 1.0891 1.0920 1.0947 1.0969
irintensity: 1.0363 0.1368 1.3576 4.0833 0.3613 0.6849 0.2397 3.1242 0.7849 0.5071 0.3759 4.2773 1.9749 0.8290 0.2352 0.9393 3.4325 7.0552 3.5311 6.5896 0.7854 7.2788 3.5323 80.5586 15.2612 22.6522 5.3857 2.4490 6.4028 3.1188 0.1289 21.6766 7.5423 2.0973 8.2236 2.3105 47.2649 35.5976 83.8375 5.2872 42.8943 2.1282 13.1416 4.7632 32.3146 26.4100 17.6413 67.4151 3.7354 1.3627 1.5330 3.4519 3.6315 1.6767 23.7864 44.3227 6.1932 4.6673 29.3316 467.0633 88.2458 147.9200 47.3210 205.6516 133.7251 81.1950 57.7403 6.1960 16.6446 42.3588 66.9958 42.1642
temp: 298.150 k
press: 1.00000 atm
elementType: 6 6 6 6 6 6 1 1 1 5 7 6 6 1 6 1 1 1 6 1 1 1 6 1 1 1
symmnumber: 1
zpe: 556621.3 jmol-1
zpe.correction: 0.212006 hartree
zpe.thermalcorrener: 0.223408 hartree
zpe.thermalcorrenthalpy: 0.224352 hartree
zpe.thermalcorrgfe: 0.175392 hartree
zpe.sumelectzpe: -506.440008 hartree
zpe.sumelectthermal: -506.428606 hartree
zpe.sumelectthermalent: -506.427662 hartree
zpe.sumelectthermalfe: -506.476622 hartree
dipole: -9.9868 5.0444 2.0715
dipole: 11.3786
quadrupole: -106.9033 -92.2643 -93.1207
quadrupole: 11.0615 3.8787 -3.1589
quadrupole: -9.4739 5.1652 4.3087 11.0615 3.8787 -3.1589
hfenergy: -506.6520141 hartree
pointgroup: C01 [X(C11H13B1N1)]
dipole: -3.3976577 2.2531771 -0.4681341 debye
dipolederiv: 0.3971066 0.4158662 -0.1898366 -0.1021907 0.0159922 0.029374 0.0231597 -0.0188757 0.1125946 -0.154952 -0.1794773 0.0959828 -0.325043 0.1496418 -0.1173716 0.1441449 -0.1002245 -0.1696383 0.0884916 -0.0436546 -0.0216243 0.3183777 -0.4046231 0.0725735 -0.1439354 0.081169 -0.2073037 0.1680794 -0.1275223 0.0382181 -0.1515986 0.205703 -0.1239243 0.0254085 -0.1117589 -0.102453 -0.2159698 0.0295167 -0.0262849 -0.0811316 -0.0581278 -0.0532994 0.0280729 -0.0723954 -0.2159861 -0.4494345 -0.0373931 0.0574067 0.4012282 0.0678064 -0.0443573 -0.1080657 -0.0107887 0.0518088 -0.1447675 -0.0740392 0.0535341 -0.0639167 0.0872211 0.0202673 0.0486638 0.0185788 0.1048473 0.035649 -0.0936773 0.0448823 -0.0802783 -0.1391895 0.1162729 0.0412773 0.1155281 0.0984323 -0.0404365 0.1509455 -0.0397581 0.0818787 -0.0668134 0.0796118 -0.0140271 0.0728356 0.1351855 0.7593462 -0.0266624 -0.0343596 -0.0468643 0.483844 0.0668225 -0.088594 0.1170053 0.5471115 -0.5388826 0.0305607 0.0065971 0.0816084 -0.4196504 0.058532 -0.0330867 0.068315 -0.3193437 0.3421014 0.0748979 -0.0691157 0.0624001 0.2428142 -0.1523331 -0.063044 -0.154413 -0.0833429 -0.0058249 0.0242224 -0.0221504 -0.1810267 -0.4176609 0.1072916 0.0585284 0.0904873 -0.2100618 -0.1658409 -0.0473684 0.0424692 -0.0413202 0.0863246 0.0322391 0.0403868 0.0338354 0.1468887 0.2020142 -0.1818169 0.0515275 0.0197375 0.4796893 -0.1958836 -0.0234351 -0.1878696 0.0352821 0.0015021 -0.0770417 0.0377766 -0.1335043 -0.1292911 0.1021816 0.0603179 0.1017672 0.0695416 -0.0200048 0.0840885 -0.0192093 0.1435703 -0.0414729 0.0573945 -0.0440627 0.0620242 0.1174748 -0.3011268 -0.0795536 -0.0891301 -0.0100311 -0.5705137 -0.1762392 -0.0446179 -0.2057264 -0.3047522 -0.4759995 -0.0002831 0.1838589 -0.0107025 0.047292 0.0627632 0.157243 0.0376091 -0.0144539 -0.025018 -0.1184037 -0.0562771 -0.1930268 -0.1842066 -0.1090231 -0.093051 -0.1265284 -0.0262081 -0.1403361 0.1767029 -0.0403447 0.2615855 -0.1641167 0.0283211 -0.0736902 0.0491355 0.0494584 0.0651004 -0.0101303 0.0179634 -0.0353564 0.0243102 0.079026 0.0782177 0.0610539 -0.3264327 -0.0868074 0.0505322 -0.0022997 0.0581969 0.0292984 0.1152498 0.0574395 0.0775179 -0.4087535 -0.1607024 -0.0796109 0.1901982 -0.0679025 0.027851 0.0394825 0.150223 0.0058529 -0.0020502 -0.1414653 0.2080826 -0.1320718 0.2166354 -0.1780499 0.1308439 -0.1272777 0.1127687 -0.0019631 0.0081779 -0.0687809 -0.0779526 -0.1213251 -0.1740721 -0.2258158 -0.0561961 -0.1169034 -0.0758825 unknown
polarizability: 239.8578469|7.3832805|201.643638|-11.1986085|-34.3647061|137.378056 unknown
InChI: InChI=1/C11H13BN/c1-12(2)10-7-3-5-9-6-4-8-13-11(9)10/h3-8,12H,1-2H3
charge -1 multiplicity 1
26 atoms
C  -0.18689958 0.01933059 -0.70813751
C  1.2391931 0.13135723 -0.88337988
C  1.67814832 1.34730105 -1.37841247
C  0.82288551 2.42489325 -1.70410872
C  -0.5301247 2.31085949 -1.54388539
C  -1.06241291 1.09788002 -1.04147362
H  2.74360858 1.48887627 -1.5333334
H  1.24833011 3.3481163 -2.08821701
H  -1.2039202 3.12560738 -1.79341993
B  2.2816468 -1.08117494 -0.51915172
N  -0.69478351 -1.15222699 -0.22024452
C  -2.45412357 0.91835474 -0.86199733
C  -2.92765995 -0.26780467 -0.37567918
H  -3.98715309 -0.44369265 -0.22699158
C  -1.98790041 -1.27653431 -0.06723102
H  -2.33820486 -2.23121858 0.32344163
H  -3.12996362 1.73040948 -1.11698811
H  1.86907603 -2.10649461 -1.08199822
C  3.80285599 -0.76456911 -1.06276723
H  4.2688638 0.10278681 -0.56583748
H  4.46295956 -1.62137882 -0.86385361
H  3.85383242 -0.57492304 -2.14601281
C  2.31595046 -1.32129929 1.11005351
H  1.33586716 -1.60285908 1.51317185
H  3.02499999 -2.11718863 1.38445686
H  2.63924459 -0.41320693 1.6458059
