program: Gaussian 16
title: me_xanthene_hydride
version: AS64L-G16RevC.02
method: RwB97XD
basis: GenECP
operation: Freq
keyword: #N
keyword: Geom=AllCheck
keyword: Guess=TCheck
keyword: SCRF=Check
keyword: GenChk
keyword: RwB97XD/GenECP
keyword: Freq
converged: YES YES YES YES
title: Mulliken charges:
elementType: C C C C C C H H H C O C H H H C H H H C C C C C H C H H B N C H H H C H H H C H H H C H H H H
charge: 0.192333 -0.061714 -0.778302 -0.357251 0.490440 -0.091876 0.154274 0.201907 0.129012 -0.245582 -0.033324 -0.433477 0.153070 0.161794 0.191589 -0.781011 0.176439 0.165897 0.197255 0.367878 0.034488 -0.069151 0.107568 -0.639185 0.142884 -0.511889 0.223187 0.155340 -0.027542 0.265242 -0.562842 0.122875 0.103230 0.114577 -0.641666 0.102850 0.081868 0.172248 -0.366880 0.148116 0.165514 0.165731 -0.399994 0.171417 0.141336 0.162590 -0.161267
chargesum: -1.00000
title: Mulliken charges with hydrogens summed into heavy atoms:
elementType: C C C C C C C O C C C C C C C C B N C C C C
charge: 0.192333 0.092560 -0.576395 -0.228239 0.490440 -0.091876 -0.245582 -0.033324 0.072976 -0.241420 0.367878 0.034488 0.073733 0.107568 -0.415998 -0.356549 -0.188809 0.265242 -0.222159 -0.284699 0.112481 0.075349
1716.lowfreq: -0.0004 -0.0003 0.0004 1.8454 15.7230 22.2861 44.9607 55.7301 70.1015
frequency: 44.6916 55.2710 69.9145 116.8363 118.5554 147.7811 154.8027 166.2421 185.8249 195.8496 238.3271 254.6624 257.9739 272.0573 279.6522 285.9961 290.9099 306.2324 310.4191 318.9226 320.7791 349.0457 358.5416 379.4098 383.9922 391.1845 417.1691 447.6932 471.0942 502.1281 520.2092 552.8651 563.8717 580.6567 587.5057 597.9206 617.1656 652.9559 687.8028 703.7154 748.7170 756.8458 760.5476 770.2965 792.9600 805.5003 814.2093 820.2051 848.4090 877.9538 893.6827 896.6371 906.3003 925.6186 943.9531 963.6902 975.6007 976.7958 993.9127 1016.2436 1027.7682 1036.5979 1095.7994 1101.1699 1114.5271 1122.6121 1133.1817 1138.4541 1161.8028 1168.5753 1180.4533 1188.1794 1192.9234 1204.0560 1222.4568 1242.5947 1256.0866 1282.1436 1286.6341 1290.6665 1294.2404 1312.9661 1318.8315 1336.6608 1349.8935 1390.8337 1395.4569 1417.8054 1451.5858 1455.2448 1470.4185 1481.1513 1483.0719 1484.8676 1489.4393 1490.0162 1494.1736 1501.5125 1505.3310 1510.8720 1512.2542 1515.4752 1518.3933 1525.6383 1530.6888 1550.7167 1632.1612 1649.2811 1653.1798 1673.2237 2253.4242 2938.2471 2952.5499 2964.2618 2978.1264 3017.7269 3030.0513 3032.3686 3041.1601 3049.2020 3079.6346 3082.5540 3106.4612 3108.7163 3122.6469 3127.8048 3127.9909 3130.4213 3160.8981 3182.7732 3183.0030 3193.9753 3204.3669 3216.6345 3222.0123
redmass: 3.9030 3.6589 3.4498 3.0637 2.6373 3.4963 3.0156 2.8698 3.3248 3.5525 2.1570 1.4095 1.6669 1.8468 1.4252 2.0762 2.3251 1.6015 1.2587 2.4572 1.4975 2.7370 2.1058 2.4388 2.5168 2.2546 2.6736 4.3192 3.4313 3.3438 4.2468 3.8506 3.7478 3.8145 3.6403 4.2641 4.0111 4.4095 5.7921 3.6758 1.8211 1.4389 1.4194 1.4668 1.5048 2.9579 3.9922 4.1691 4.9759 3.0568 1.4417 4.2257 1.5200 1.6733 1.7895 1.8501 1.3574 1.8513 1.3788 1.7900 1.3318 2.2423 1.4397 1.7363 2.5164 1.8508 1.3702 1.7224 1.6118 2.3024 1.5210 2.6518 1.4197 1.4380 2.2432 2.2492 2.4508 1.3945 2.9918 3.7262 2.0170 1.2585 2.3090 5.5649 6.4406 2.6550 1.2829 1.2586 2.1039 1.3533 1.0956 1.1616 1.1100 1.0740 1.1134 1.0850 1.0574 1.5587 1.1531 1.4213 1.3651 1.1750 1.3490 1.1392 1.2262 1.7860 5.4409 7.3696 6.0403 7.7936 1.0791 1.0596 1.0602 1.0392 1.0414 1.0953 1.0354 1.0948 1.0965 1.0360 1.0726 1.0936 1.1028 1.0794 1.1012 1.1037 1.1023 1.1022 1.0856 1.0918 1.0877 1.0965 1.0927 1.0903 1.0943
irintensity: 0.5398 0.6872 2.0091 0.6463 4.0007 1.0532 0.8093 1.4032 2.8277 1.9398 3.1869 1.1878 0.4042 2.4405 0.9896 2.4257 2.0762 0.1669 0.3484 0.5728 4.9446 2.3066 0.1670 1.8666 0.7860 0.2672 1.7784 6.5781 0.2684 1.5303 0.1162 3.7156 1.5491 0.9260 4.0518 5.1710 1.4315 2.2503 2.1382 0.0141 3.7309 52.0721 10.2665 63.3071 1.3616 4.3935 8.3237 9.6395 6.1616 2.3325 1.5881 35.4664 6.4509 2.1269 2.7997 10.6604 0.3071 7.0465 0.9311 13.3072 1.8283 80.0139 39.5138 32.7970 22.1067 17.8294 23.9965 77.6196 44.3474 5.9777 31.9876 64.0839 24.6133 35.4268 178.6317 7.3911 26.5414 53.2969 15.0958 344.4934 15.2695 14.3582 28.6876 12.5447 31.8916 78.9980 24.9170 6.0737 185.9308 41.7691 19.5058 2.8668 14.0379 0.5344 28.1453 3.9439 18.5570 4.8247 30.8227 3.7746 56.0446 22.1722 37.8404 5.8357 6.8722 155.5201 22.1815 4.5465 25.3331 62.0679 463.6445 140.5270 241.3199 105.2070 129.6841 116.2418 50.4771 190.4119 53.6459 36.2308 37.7239 63.9601 34.2661 29.2832 52.7689 24.1527 20.3601 39.5510 12.0770 55.0946 14.9273 5.4173 41.5843 17.6507 24.5432
temp: 298.150 k
press: 1.00000 atm
elementType: 6 6 6 6 6 6 1 1 1 6 8 6 1 1 1 6 1 1 1 6 6 6 6 6 1 6 1 1 5 7 6 1 1 1 6 1 1 1 6 1 1 1 6 1 1 1 1
symmnumber: 1
zpe: 1052676.6 jmol-1
zpe.correction: 0.400943 hartree
zpe.thermalcorrener: 0.421648 hartree
zpe.thermalcorrenthalpy: 0.422593 hartree
zpe.thermalcorrgfe: 0.354362 hartree
zpe.sumelectzpe: -893.540043 hartree
zpe.sumelectthermal: -893.519337 hartree
zpe.sumelectthermalent: -893.518393 hartree
zpe.sumelectthermalfe: -893.586624 hartree
dipole: 14.9131 -4.4025 -5.2624
dipole: 16.4157
quadrupole: -188.2076 -158.5743 -157.4726
quadrupole: 16.4222 17.4062 0.9484
quadrupole: -20.1227 9.5105 10.6122 16.4222 17.4062 0.9484
hfenergy: -893.9409859 hartree
pointgroup: C01 [X(C19H25B1N1O1)]
dipole: -0.6603416 3.8125573 -2.7166807 debye
polarizability: 333.2150065|29.3600527|309.8750765|36.8350277|-55.6327225|272.8219332 unknown
InChI: InChI=1/C19H25BNO/c1-19(2)13-9-7-11-15(20(3)4)17(13)22-18-14(19)10-8-12-16(18)21(5)6/h7-12,20H,1-6H3
charge -1 multiplicity 1
47 atoms
C  -2.25679196 1.49820767 1.14470223
C  -0.89629371 1.34119945 1.43688026
C  0.07157344 2.27527628 1.07387595
C  -0.2964778 3.44017306 0.41561779
C  -1.63921065 3.67068703 0.11260703
C  -2.56015093 2.68524499 0.4639746
H  -0.58244855 0.44555278 1.96494212
H  1.11673007 2.09932855 1.31229706
H  0.46052824 4.16934601 0.15188872
C  -2.16336356 4.97264113 -0.48863463
O  -3.89559362 2.88630833 0.1448114
C  -1.07396426 5.74581097 -1.23615742
H  -1.46610988 6.68709777 -1.62864169
H  -0.25669398 6.00605879 -0.56027043
H  -0.66512034 5.16392407 -2.0665444
C  -2.69077409 5.86122307 0.66354606
H  -1.87574332 6.10451047 1.35184491
H  -3.10784307 6.7920726 0.26539373
H  -3.47149777 5.34656742 1.22821677
C  -3.34298348 4.62777939 -1.39250935
C  -4.18930386 3.60818551 -0.96767326
C  -3.6428729 5.30314763 -2.57771632
C  -5.36985341 3.26727858 -1.66812555
C  -4.78292777 4.97866475 -3.29275167
H  -2.98818535 6.08428852 -2.94283809
C  -5.64429957 3.98653708 -2.83555488
H  -5.01655762 5.50661897 -4.21121578
H  -6.53742236 3.76340421 -3.40484697
B  -3.39253487 0.38116413 1.54728521
N  -6.17385464 2.20341466 -1.2417553
C  -2.78831353 -0.74451414 2.58213274
H  -3.57497064 -1.4463558 2.89418162
H  -1.99316912 -1.35882824 2.12789679
H  -2.3682151 -0.31303049 3.50330819
C  -3.97011231 -0.34805044 0.18927059
H  -3.18220509 -0.92513731 -0.32174499
H  -4.77543521 -1.06058569 0.42863595
H  -4.3781935 0.36178158 -0.53992726
C  -6.65001537 2.20232356 0.13487791
H  -7.46091002 2.93635576 0.28110575
H  -7.0345766 1.20771354 0.37167331
H  -5.83594251 2.40541262 0.82429795
C  -7.16207559 1.70789774 -2.17130933
H  -7.53986617 0.75399819 -1.79673954
H  -8.0249471 2.38598028 -2.29961744
H  -6.71170695 1.53020774 -3.15021517
H  -4.3242816 0.97775423 2.11367782
