program: Gaussian 16
title: no2_benzopiperidine_hydride
version: AS64L-G16RevC.02
method: RwB97XD
basis: GenECP
operation: Freq
keyword: #N
keyword: Geom=AllCheck
keyword: Guess=TCheck
keyword: SCRF=Check
keyword: GenChk
keyword: RwB97XD/GenECP
keyword: Freq
converged: YES YES NO YES
title: Mulliken charges:
elementType: H C C C C H C H H B H C N C C C H H C H H C H H H H H H N N O O O O
charge: 0.196436 -0.463716 -0.146696 -0.426898 -0.205869 0.203585 0.192217 0.203868 0.171754 0.112847 0.104944 -0.518824 0.543563 -0.477746 0.088628 -0.281957 0.113955 0.168177 -0.602442 0.178628 0.129038 -0.387490 0.185013 0.159653 0.180296 0.173090 0.180826 0.137591 -0.373775 -0.445230 -0.038074 -0.038947 0.017609 -0.034055
chargesum: -1.00000
title: Mulliken charges with hydrogens summed into heavy atoms:
elementType: C C C C C B C N C C C C C N N O O O O
charge: -0.267281 0.056890 -0.223030 -0.205869 0.363971 0.217791 -0.518824 0.543563 -0.195614 0.396295 0.062708 -0.249056 -0.069073 -0.373775 -0.445230 -0.038074 -0.038947 0.017609 -0.034055
1716.lowfreq: -7.8702 -0.0009 -0.0009 0.0005 13.6048 26.9861 51.4417 61.1959 67.1744
frequency: 48.6411 60.7454 66.8522 72.6121 87.9397 94.8391 115.4280 158.4215 164.3834 206.4825 228.0902 269.1926 283.7551 293.2297 331.5292 339.7661 371.8895 411.9645 469.6724 483.5375 487.0372 508.4149 521.5480 572.0011 580.2554 636.7993 669.0556 712.5636 761.8827 774.8144 789.3402 800.7239 833.7641 834.9757 858.4102 874.7728 888.3978 907.6379 919.4607 936.4457 958.4716 979.3186 984.6659 1009.2249 1050.8909 1070.8035 1081.7843 1090.2829 1094.8357 1140.3997 1161.0913 1165.3239 1176.4629 1184.2145 1191.3478 1214.1801 1266.6482 1271.0438 1294.0588 1307.1531 1315.5000 1331.9308 1359.6595 1377.1138 1389.2177 1393.9926 1397.0779 1432.5856 1478.4883 1480.9476 1481.4075 1486.2882 1493.2099 1494.9605 1500.2298 1519.6425 1533.3998 1551.3790 1570.7392 1635.5933 1664.0857 2600.1452 2895.7487 2908.2332 3018.5413 3040.6197 3045.8532 3077.0820 3088.9491 3093.3290 3095.7024 3164.2964 3170.3155 3182.2551 3196.2498 3207.0827
redmass: 11.9611 4.1658 8.0227 4.4342 12.9826 5.0658 4.1544 9.8126 4.9936 4.8391 4.2346 3.7245 2.5797 3.3298 6.6183 3.5883 11.8926 1.9806 2.9808 3.4267 4.1861 2.6564 3.7894 3.3255 5.3980 3.6660 5.5066 3.8002 4.1877 1.5869 5.4116 3.6986 2.7494 1.7524 2.9264 1.4503 1.5559 7.8191 6.5499 2.3106 3.0186 1.3947 1.3116 1.3310 2.7526 2.0229 2.0334 1.5494 1.7835 1.5262 1.6657 1.9480 1.5740 1.2286 1.1527 2.4536 1.7733 2.2429 1.2640 1.2079 2.9795 1.9528 1.3103 1.7046 1.4750 1.5038 1.4156 1.6308 4.6745 1.9330 1.4491 1.0905 3.8082 1.4069 1.1081 1.1353 2.5108 10.7931 13.4373 6.1017 5.6314 1.0878 1.0721 1.0736 1.0658 1.0619 1.0613 1.0945 1.1020 1.0912 1.1045 1.0870 1.0850 1.0902 1.0949 1.0950
irintensity: 0.1260 1.5780 0.6404 1.7714 1.2189 1.2173 1.5565 7.5434 0.9929 0.3909 3.5140 0.4867 0.6446 1.1074 1.5185 0.0304 1.2599 2.5624 1.6808 2.9476 4.6118 11.6824 16.1873 10.1000 28.4298 0.4314 16.1773 83.3424 9.1214 23.3130 29.4929 21.8465 17.3256 4.7267 2.1411 9.3949 3.9559 0.5450 1.0717 3.5496 23.3673 2.2122 0.7869 0.3508 10.5188 11.3437 19.7991 8.4465 11.7846 81.9411 29.6989 2.2840 18.1030 4.0193 1.1301 77.9525 101.6154 30.4995 2.5783 5.2229 10.6897 25.7547 1.2903 27.4824 1.7466 2.4295 2.7867 49.0582 86.5044 17.2425 35.1649 7.2925 40.5266 21.3998 2.5858 38.1227 164.9660 579.8080 372.9396 32.2757 61.6470 110.5488 98.4046 158.8821 54.2234 37.9589 41.7102 92.4887 56.5767 16.4649 83.3335 1.5412 3.6065 12.9516 43.7740 25.7919
temp: 298.150 k
press: 1.00000 atm
elementType: 1 6 6 6 6 1 6 1 1 5 1 6 7 6 6 6 1 1 6 1 1 6 1 1 1 1 1 1 7 7 8 8 8 8
symmnumber: 1
zpe: 710529.9 jmol-1
zpe.correction: 0.270627 hartree
zpe.thermalcorrener: 0.287207 hartree
zpe.thermalcorrenthalpy: 0.288151 hartree
zpe.thermalcorrgfe: 0.225818 hartree
zpe.sumelectzpe: -917.901962 hartree
zpe.sumelectthermal: -917.885382 hartree
zpe.sumelectthermalent: -917.884438 hartree
zpe.sumelectthermalfe: -917.946771 hartree
dipole: -10.6070 6.3076 -1.2860
dipole: 12.4076
quadrupole: -139.1425 -132.3765 -137.2131
quadrupole: 16.7544 -3.1655 -2.4484
quadrupole: -2.8985 3.8675 -0.9690 16.7544 -3.1655 -2.4484
hfenergy: -918.1725889 hartree
pointgroup: C01 [X(C11H15B1N3O4)]
dipole: -3.9069799 2.559525 -0.2660639 debye
polarizability: 239.2826008|3.5361378|224.9269036|-3.8535681|-12.636201|171.8011239 unknown
InChI: InChI=1/C11H15BN3O4/c16-14(17)12(15(18)19)10-6-2-3-7-11(10)13-8-4-1-5-9-13/h2-3,6-7,12H,1,4-5,8-9H2
charge -1 multiplicity 1
34 atoms
H  3.01889053 3.29341466 -0.94559371
C  2.1083611 2.7335065 -0.76046717
C  2.17178559 1.39290779 -0.39510183
C  0.86730036 3.3373464 -0.89705946
C  1.0328312 0.61925921 -0.15746663
H  3.14542403 0.9198786 -0.31331871
C  -0.28686059 2.60498118 -0.64700327
H  0.78974182 4.38066739 -1.18668242
H  -1.24948604 3.09540317 -0.73351465
B  1.1793594 -0.94908698 0.16100446
H  0.16937076 -1.58933628 0.11328625
C  -0.22270272 1.25719891 -0.27368944
N  -1.41098143 0.52735964 -0.01927234
C  -1.62672536 0.16475902 1.37863808
C  -2.63340643 0.98696866 -0.651847
C  -2.63653517 -0.97013519 1.49048366
H  -0.67695664 -0.11841539 1.82777593
H  -1.995818 1.04497445 1.94170177
C  -3.68694226 -0.11886176 -0.62384047
H  -2.41074454 1.26396673 -1.68510275
H  -3.04665117 1.88422829 -0.14839832
C  -3.9494715 -0.59095769 0.80613199
H  -2.80401634 -1.20683947 2.54582027
H  -2.20930366 -1.85936816 1.01449442
H  -4.60997546 0.24878967 -1.08417996
H  -3.32620238 -0.95754904 -1.22891416
H  -4.64744626 -1.43382118 0.81031168
H  -4.42704811 0.2213286 1.37066012
N  2.21201093 -1.58667719 -0.88614624
N  1.79032109 -1.25824603 1.61818598
O  1.76101114 -2.11033084 -1.89758432
O  3.41976452 -1.47388226 -0.70421583
O  2.21726391 -2.38293713 1.84500702
O  1.72627168 -0.4064213 2.49937604
