program: Gaussian 16
title: MeQHBCN2-H-
version: ES64L-G16RevC.01
method: RwB97XD
basis: GenECP
operation: Freq
keyword: #N
keyword: Geom=AllCheck
keyword: Guess=TCheck
keyword: SCRF=Check
keyword: GenChk
keyword: RwB97XD/GenECPFreq
converged: YES YES NO NO
title: Mulliken charges:
elementType: C H C N N N B C H H H H N O O N O O
charge: -0.310227 0.224584 -0.617545 0.277499 -0.116398 -0.127848 0.362338 -0.396643 0.186810 0.193529 0.197261 0.055012 -0.258694 -0.133300 -0.038844 -0.427478 -0.045114 -0.024942
chargesum: -1.00000
title: Mulliken charges with hydrogens summed into heavy atoms:
elementType: C C N N N B C N O O N O O
charge: -0.085643 -0.617545 0.277499 -0.116398 -0.127848 0.417351 0.180956 -0.258694 -0.133300 -0.038844 -0.427478 -0.045114 -0.024942
1716.lowfreq: -18.4958 0.0003 0.0007 0.0008 7.3613 21.2917 28.6044 46.9544 61.4896
frequency: 14.7609 43.7889 60.8974 74.8571 88.3789 120.7433 165.3459 192.2103 264.8848 319.3990 336.1489 383.3661 393.5566 525.5629 586.3754 652.7434 692.2340 714.0646 752.8449 789.7371 804.8350 854.4718 903.2589 909.2524 1020.8148 1057.7205 1079.3878 1082.4031 1101.4481 1152.9227 1169.2763 1298.2309 1312.2884 1385.6168 1452.9113 1482.8975 1487.7526 1491.5143 1497.2832 1526.0176 1560.8867 1572.4381 1579.3033 2589.0512 3065.7917 3143.4478 3177.9083 3291.5826
redmass: 12.2776 5.0780 11.0269 1.2446 5.0696 5.7295 13.1744 3.7025 7.3126 10.8616 9.4918 11.9185 3.5454 7.2590 6.9798 4.4340 5.1866 6.5770 4.6875 6.3847 3.2451 1.5678 6.9000 6.3295 2.2659 2.3387 1.8698 2.1708 1.7393 1.3313 2.2190 6.6933 5.2669 6.3020 1.3057 10.6338 1.9036 1.0516 14.1800 1.7791 14.3013 11.6160 6.5640 1.0897 1.0339 1.1059 1.1035 1.1008
irintensity: 2.2434 10.7129 0.8765 1.0419 0.3118 12.1138 1.3488 0.4986 2.2686 0.0601 3.6365 1.2555 7.7649 19.9906 32.8501 6.1530 24.3267 6.6960 36.2109 42.2255 10.2491 12.2106 2.6223 5.9663 32.1888 54.5904 51.4143 34.7058 36.2958 2.0841 86.7731 32.9207 25.6537 0.9387 4.1378 33.3616 13.7278 13.8817 75.0699 11.7565 827.6960 227.1351 85.2752 132.7964 51.4454 14.9784 3.8655 1.6658
temp: 298.150 k
press: 1.00000 atm
elementType: 6 1 6 7 7 7 5 6 1 1 1 1 7 8 8 7 8 8
symmnumber: 1
zpe: 306379.3 jmol-1
zpe.correction: 0.116694 hartree
zpe.thermalcorrener: 0.128809 hartree
zpe.thermalcorrenthalpy: 0.129753 hartree
zpe.thermalcorrgfe: 0.075094 hartree
zpe.sumelectzpe: -716.660659 hartree
zpe.sumelectthermal: -716.648544 hartree
zpe.sumelectthermalent: -716.647600 hartree
zpe.sumelectthermalfe: -716.702259 hartree
dipole: -21.2709 6.1387 -7.7133
dipole: 23.4442
quadrupole: -189.9034 -66.0156 -114.1184
quadrupole: 18.4525 -37.7112 8.1034
quadrupole: -66.5576 57.3302 9.2274 18.4525 -37.7112 8.1034
hfenergy: -716.7773525 hartree
pointgroup: C01 [X(C3H5B1N5O4)]
dipole: -1.6048493 3.3826825 -0.7329554 debye
dipolederiv: -0.0214974 -0.2033419 -0.004635 0.0167763 0.1931332 0.0502409 0.0225233 -0.1898204 -0.0521193 0.1501975 -0.0335302 -0.0368252 -0.0230226 0.090575 -0.0575682 -0.0501964 -0.0514602 0.1363034 -0.141965 -0.0302689 0.0180085 -0.0334097 -0.2537939 -0.1105307 -0.0407987 0.0123973 -0.2681094 -0.0662256 0.155881 0.0584998 0.2124911 -0.7952291 0.0675208 0.0437887 0.0802039 -0.0037672 -0.4424427 0.120365 -0.2630555 0.1798172 0.3567313 0.2787637 -0.2205975 0.2181827 -0.387817 -0.0823438 0.1485873 0.2335459 -0.0556815 -0.5560355 -0.1006418 0.1741598 0.1119614 -0.0543228 0.9222176 -0.3027617 0.0363143 -0.2867878 0.8324375 0.0190638 0.0304973 -0.0855343 0.8792063 0.2697013 -0.1495112 -0.0443311 -0.1542191 0.6435846 -0.0604708 -0.0357374 -0.1019542 0.2106848 -0.0449354 -0.1045422 0.0329365 0.0054936 -0.0777887 0.0284344 0.0131955 0.0285925 0.0965389 0.0474267 0.0536877 -0.0665327 -0.0152899 0.0557101 -0.0430044 -0.0855656 0.0498178 0.0008885 0.0275071 0.0913993 0.0608029 0.0530105 -0.0598248 0.0216639 0.1034593 -0.0759564 -0.0401435 -0.1856769 -0.0028769 0.005978 0.0025386 -0.3178472 -0.0405548 0.0245191 -0.019651 -0.1699332 0.5604589 0.9553463 -0.3499983 0.9025997 1.4142311 -0.3111859 -0.1522018 -0.2794467 0.6940199 -0.5909847 -0.4315476 0.0865714 -0.5111135 -1.1078231 0.0983322 -0.2274356 -0.3262493 -0.6352272 -0.5580832 -0.4889492 0.2013549 -0.3647768 -0.86933 0.135315 0.383649 0.6213725 -0.8330946 0.7110852 -0.249877 0.2387069 -0.344367 0.7060804 -0.898432 0.2476427 -0.9048616 1.4772308 -0.5889877 -0.0888173 0.3713019 0.1682795 -0.6108619 0.4568655 -0.1045699 0.5548319 -1.1808411 -0.9654519 0.5607577 -0.5786433 0.2476614 -0.6439491 0.4661883 -0.1263315 0.357574 -0.8694974 unknown
polarizability: 109.3307441|-6.6154143|130.0480085|14.8596562|-14.0605157|114.9466849 unknown
InChI: InChI=1/C3H5BN5O4/c1-7-2-3(5-6-7)4(8(10)11)9(12)13/h2,4H,1H3
charge -1 multiplicity 1
18 atoms
C  2.95851283 1.79144189 0.97468868
H  3.4970358 2.44018081 1.64512177
C  3.00778247 0.42866797 0.7808818
N  2.03844267 2.24633786 0.10263635
N  1.52383322 1.23271778 -0.60515916
N  2.09970948 0.14211614 -0.20185642
B  3.90299912 -0.67515547 1.48486013
C  1.57091517 3.6005987 -0.10108193
H  2.41807996 4.26574994 -0.27152035
H  0.92741876 3.59808245 -0.97888584
H  1.00332216 3.94293499 0.76600932
H  3.55491829 -1.80355842 1.28753054
N  3.92020284 -0.38126486 3.06166976
O  4.48223729 0.6363553 3.45927398
O  3.32323729 -1.12652374 3.82461523
N  5.44639415 -0.60447678 1.04124758
O  5.7590077 -0.04384553 -0.00068543
O  6.27157318 -1.19110508 1.73197321
