program: Gaussian 16
title: no2_nmeimidazole_hydride
version: AS64L-G16RevC.02
method: RwB97XD
basis: GenECP
operation: Freq
keyword: #N
keyword: Geom=AllCheck
keyword: Guess=TCheck
keyword: SCRF=Check
keyword: GenChk
keyword: RwB97XD/GenECPFreq
converged: YES YES NO YES
title: Mulliken charges:
elementType: C H C N N B C H H H C H N N O O O O H
charge: -0.372483 0.187036 -0.469184 0.048001 -0.160800 0.354063 -0.401551 0.151109 0.197413 0.192250 0.109477 0.222974 -0.504254 -0.343416 -0.113027 -0.029979 -0.008298 -0.072621 0.013290
chargesum: -1.00000
title: Mulliken charges with hydrogens summed into heavy atoms:
elementType: C C N N B C C N N O O O O
charge: -0.185447 -0.469184 0.048001 -0.160800 0.367354 0.139221 0.332451 -0.504254 -0.343416 -0.113027 -0.029979 -0.008298 -0.072621
1716.lowfreq: -0.8939 0.0004 0.0004 0.0009 18.2817 27.0441 42.2212 54.4893 66.1429
frequency: 30.1050 41.4599 65.8304 76.7677 86.3971 114.5866 174.4385 194.1908 262.7563 307.5147 326.4844 361.4625 393.7923 519.7344 585.8669 629.7322 679.6606 687.6344 735.4484 769.7765 788.0911 814.3758 836.8874 902.7462 913.7477 993.6679 1071.0215 1076.9557 1088.8635 1109.0616 1150.2065 1186.5407 1252.2653 1301.1401 1412.6397 1437.6740 1460.6142 1483.4388 1486.4579 1496.9983 1521.9276 1549.8443 1557.4622 1570.6096 1591.5292 2562.4289 3053.2436 3125.3525 3151.1203 3239.7888 3280.8063
redmass: 4.8355 8.3337 1.1774 8.3898 7.7790 5.5384 6.6085 5.0157 6.7508 7.0600 11.7427 7.2393 4.1416 7.2441 7.5399 3.0143 4.2357 4.7694 2.2080 2.0695 7.9585 3.7185 1.5489 9.1298 6.3677 3.1686 4.1272 1.5164 1.4956 1.4966 1.3121 1.6033 1.5188 5.0482 4.0151 7.0753 1.2786 14.4255 1.0380 14.5847 1.1391 5.8703 9.1546 13.9563 4.5555 1.0896 1.0335 1.1059 1.1034 1.0965 1.0992
irintensity: 2.9218 1.6546 0.4545 1.5931 1.1915 6.5183 2.2130 0.6649 1.6137 2.5639 1.7105 1.1141 1.8182 20.3629 26.5812 14.1622 14.2158 36.7671 40.4694 7.2203 38.1712 9.9562 23.7263 0.8936 4.6529 19.8079 20.5116 43.8054 12.9876 94.6901 0.2011 113.8328 24.3497 6.1910 0.7984 1.9421 19.0691 60.2105 11.6515 35.6725 15.5345 87.4550 751.5192 341.0022 57.2731 163.9990 72.2516 20.8655 15.3977 6.9611 0.0249
temp: 298.150 k
press: 1.00000 atm
elementType: 6 1 6 7 7 5 6 1 1 1 6 1 7 7 8 8 8 8 1
symmnumber: 1
zpe: 338011.7 jmol-1
zpe.correction: 0.128742 hartree
zpe.thermalcorrener: 0.140996 hartree
zpe.thermalcorrenthalpy: 0.141940 hartree
zpe.thermalcorrgfe: 0.087708 hartree
zpe.sumelectzpe: -700.632622 hartree
zpe.sumelectthermal: -700.620368 hartree
zpe.sumelectthermalent: -700.619424 hartree
zpe.sumelectthermalfe: -700.673655 hartree
dipole: -23.8372 7.8528 -9.3702
dipole: 26.7896
quadrupole: -186.9942 -90.0072 -110.5737
quadrupole: 20.8099 -41.9405 5.1824
quadrupole: -57.8025 39.1845 18.6180 20.8099 -41.9405 5.1824
hfenergy: -700.7613636 hartree
pointgroup: C01 [X(C4H6B1N4O4)]
dipole: -2.7581841 3.4797304 -1.4543391 debye
dipolederiv: 0.0969641 -0.2156936 0.0118414 -0.1805659 0.0262789 0.028699 0.2298723 -0.1819597 -0.0742695 0.1406472 0.0417346 0.0477151 0.0587325 0.132104 -0.0578591 0.0324858 -0.0369624 0.0238466 -0.2215475 0.02406 0.0176091 -0.0527205 -0.1955315 -0.1061634 -0.0383145 -0.0440601 0.0032068 -0.6608653 0.4912145 0.0490286 0.4654541 -0.6036354 -0.0381471 -0.0210943 0.0606589 -0.1035436 -0.5847273 0.2093556 0.043989 0.2046648 -0.5471067 -0.0360264 0.009724 0.0040802 -0.3985268 0.8586281 0.0085368 0.230012 -0.0800176 0.9553857 -0.0540717 0.2510421 -0.1144667 0.7726032 0.5575127 -0.2491773 -0.0318604 -0.2439257 0.5279172 0.0211982 -0.0240969 0.0199579 0.180786 0.0451652 0.0511688 0.0014427 0.0456231 0.0565122 -0.0072298 -0.0869184 0.075701 -0.100068 -0.1234423 0.0602728 0.0625586 -0.0445337 -0.0061953 0.0539558 0.1163996 0.0043017 0.0404105 -0.0065022 -0.0410394 -0.0456383 0.0626587 -0.1276098 -0.0658364 0.0039677 -0.1143511 0.0472234 0.3419352 -0.3330456 -0.1791703 -0.3568455 0.2880133 0.1899669 -0.2233986 0.218476 0.1296673 0.0823696 0.0778803 -0.0768993 0.0745365 0.103239 0.0557561 -0.0648427 0.0485216 -0.0242561 0.1780518 -0.3413436 0.2130833 -0.3683967 2.0209805 -0.3269675 0.182378 -0.2944172 0.744951 1.2999354 -0.3522742 -0.8469766 -0.3447169 0.7385587 0.344753 -0.8975246 0.5494237 0.5723981 -1.1461215 0.1326113 0.5278462 -0.2573852 -0.6123191 0.1294113 0.4073586 -0.1763443 -0.5639699 -0.7555109 0.0941074 0.2850604 0.6138658 -0.9598707 -0.4580165 0.4653083 -0.2878335 -0.5730103 -0.3710288 0.2744972 -0.1724591 0.162838 -1.1525436 0.2147985 -0.2984142 0.7064505 -0.8912065 -0.3661874 0.0636775 -0.1341153 0.1965352 -1.4566895 0.1197298 -0.0679439 -0.430922 -0.588454 -0.3652762 0.0034571 -0.0030672 0.0441988 -0.1874878 -0.0079508 0.0240117 -0.0062546 -0.1977882 unknown
polarizability: 115.3964125|-28.0900641|130.5295487|0.7948223|-1.6893602|125.084723 unknown
InChI: InChI=1/C4H6BN4O4/c1-7-2-4(6-3-7)5(8(10)11)9(12)13/h2-3,5H,1H3
charge -1 multiplicity 1
19 atoms
C  2.66025112 1.49132981 1.07831256
H  2.41817119 1.79542821 2.08332735
C  3.59651442 0.61147847 0.59940128
N  2.00532774 2.01421134 -0.01035396
N  3.51523114 0.59405078 -0.78714352
B  4.60869447 -0.34192565 1.36450589
C  0.93343702 2.98530486 0.01030189
H  0.64605966 3.21799039 -1.01542341
H  0.06322139 2.5869852 0.53641497
H  1.25880176 3.90510816 0.50074693
C  2.56259308 1.43486881 -1.10439069
H  2.22935304 1.67292805 -2.10538616
N  4.77717993 0.00258096 2.92030244
N  4.01777897 -1.84149259 1.33453322
O  2.94473883 -2.06134419 1.88532295
O  4.61869118 -2.71595849 0.7238632
O  5.07056179 -0.89482935 3.69959293
O  4.70286846 1.17093087 3.28743819
H  5.72550774 -0.36633168 0.92161975
