program: Gaussian 16
title: no2_quinoline_hydride
version: AS64L-G16RevC.02
method: RwB97XD
basis: GenECP
operation: Freq
keyword: #N
keyword: Geom=AllCheck
keyword: Guess=TCheck
keyword: SCRF=Check
keyword: GenChk
keyword: RwB97XD/GenECPFreq
converged: YES YES YES YES
title: Mulliken charges:
elementType: C C C C C C H C H H C C H H H N B N N O O O O H
charge: -0.015356 -0.419478 -1.371793 0.720880 -0.355640 -0.324874 0.232271 0.781156 0.168764 0.212919 -0.822833 0.116207 0.222204 0.212508 0.235115 0.114365 0.282855 -0.480616 -0.382511 -0.044465 0.009668 -0.095433 -0.018820 0.022908
chargesum: -1.00000
title: Mulliken charges with hydrogens summed into heavy atoms:
elementType: C C C C C C C C C N B N N O O O O
charge: 0.216915 -0.419478 -1.371793 0.720880 -0.186876 -0.111955 1.003359 -0.610325 0.351322 0.114365 0.305763 -0.480616 -0.382511 -0.044465 0.009668 -0.095433 -0.018820
1716.lowfreq: -15.4232 -0.0005 -0.0002 0.0004 19.3004 24.8257 57.0957 62.3977 71.6046
frequency: 49.8995 58.1446 69.6174 95.0756 131.3168 147.8324 169.3044 173.8232 245.2263 262.6818 312.6831 367.9479 426.3177 432.2365 479.5117 496.2658 540.8482 541.1975 558.1486 584.8747 652.3547 657.3733 720.9468 759.8017 774.2679 793.6935 819.6321 831.1467 849.6226 872.1042 906.4616 917.9085 936.7020 976.6661 1000.7142 1008.0513 1009.9226 1054.8506 1091.0089 1106.3836 1134.4423 1156.8615 1192.2549 1232.3981 1273.7299 1289.4418 1350.7149 1404.7404 1425.3093 1463.0710 1480.8712 1493.5088 1514.7216 1550.1552 1554.5869 1573.4316 1641.9750 1666.0743 1687.0390 2612.9162 3147.1515 3173.3475 3177.8621 3188.6571 3203.0299 3209.8542
redmass: 8.5482 13.0394 7.2053 13.6101 6.9860 5.9876 9.8773 4.3573 10.8589 4.7313 12.5186 14.0783 4.4955 4.4997 3.1464 7.3333 5.2761 7.2018 5.3531 6.4904 3.5459 7.5878 3.8074 2.9753 1.8114 4.8004 1.6005 5.5508 4.1260 5.3578 6.2462 4.9661 1.5211 1.4093 1.3433 2.4427 1.3804 2.7050 1.4415 2.1301 1.7643 1.2926 1.4031 2.1106 2.2818 1.6589 2.9404 4.3295 2.0515 2.1518 14.6249 14.3834 2.9109 4.5784 10.3457 14.0154 7.2145 5.4710 6.7321 1.0876 1.0896 1.0865 1.0894 1.0919 1.0970 1.0972
irintensity: 0.0228 0.1248 2.0376 0.3928 0.1707 1.9981 7.2564 6.3698 2.0365 1.0581 0.9583 1.7093 1.7850 3.1123 0.1594 20.5084 11.6142 4.8992 3.9444 34.2194 9.2269 16.3831 35.1510 18.9997 10.0063 9.5367 108.1174 2.0250 4.7802 10.8598 2.5011 3.8398 1.3713 0.0591 0.1566 12.1931 2.0452 0.9373 73.8514 9.2116 54.6206 6.5763 45.0377 1.5265 16.4151 16.3662 5.2950 21.1595 2.5193 0.1524 68.6735 47.2081 8.1343 227.6559 474.3696 401.9881 21.8527 5.9985 38.4882 103.8827 43.8920 2.5257 14.6783 26.4359 34.5177 29.7576
temp: 298.150 k
press: 1.00000 atm
elementType: 6 6 6 6 6 6 1 6 1 1 6 6 1 1 1 7 5 7 7 8 8 8 8 1
symmnumber: 1
zpe: 434727.2 jmol-1
zpe.correction: 0.165579 hartree
zpe.thermalcorrener: 0.179056 hartree
zpe.thermalcorrenthalpy: 0.180000 hartree
zpe.thermalcorrgfe: 0.124309 hartree
zpe.sumelectzpe: -836.963591 hartree
zpe.sumelectthermal: -836.950114 hartree
zpe.sumelectthermalent: -836.949170 hartree
zpe.sumelectthermalfe: -837.004861 hartree
dipole: -12.5589 1.8619 -0.3906
dipole: 12.7022
quadrupole: -124.5190 -106.3025 -115.4532
quadrupole: 1.0811 -1.0353 11.0459
quadrupole: -9.0941 9.1224 -0.0283 1.0811 -1.0353 11.0459
hfenergy: -837.1291698 hartree
pointgroup: C01 [X(C9H7B1N3O4)]
dipole: -4.9280451 0.9067301 -0.1447901 debye
dipolederiv: 0.1262411 0.08258 0.0157355 0.1232009 -0.1497414 -0.0063886 0.0256791 -0.019977 -0.1114203 -0.1387719 -0.0611904 0.0306492 -0.0479016 -0.2334699 -0.006782 0.0310064 0.0098845 -0.2268258 0.3107685 0.3502545 0.1318367 0.0860657 0.1550237 0.0268615 0.0456021 0.0039932 0.1227242 -0.4462088 -0.1727672 -0.0608781 0.132474 -0.0359239 -0.0240883 0.0447817 -0.0178333 0.027364 0.0144895 0.000403 -0.0136376 -0.0167978 0.0579994 0.0949388 -0.0078122 0.0846692 -0.1507566 -0.075127 -0.146565 -0.0506185 -0.0726236 0.108688 0.0839383 -0.0264823 0.0999205 -0.0986416 -0.0579637 -0.0786138 -0.032404 -0.0818355 0.0633462 -0.0216522 -0.0384288 -0.0166078 0.112786 0.2992308 0.1168584 0.0376374 0.0654085 0.3281785 0.1628486 0.0225975 0.1632384 -0.0624902 -0.0879718 0.1229624 0.0469822 0.0588048 0.0228663 -0.0483415 0.0246046 -0.0512983 0.1331931 0.0718773 -0.0125563 -0.0045657 -0.0064673 -0.1252928 -0.0996636 0.0027013 -0.1043599 0.113107 0.0002773 0.21161 0.0732305 -0.0096186 -0.4644967 -0.112654 -0.0144765 -0.1181621 -0.2082829 0.3239894 -0.3018262 -0.1142295 -0.038177 0.4422739 0.1573351 -0.0148397 0.1599478 0.0528094 -0.0696552 0.059935 0.0237333 0.1157401 0.0363572 -0.0382677 0.0465288 -0.0373612 0.1242358 -0.0855465 -0.1022692 -0.0339244 -0.0952287 0.0394105 -0.0437979 -0.0303781 -0.0397902 0.1490324 0.0600694 -0.0125726 -0.0046922 -0.0604694 -0.1529378 -0.0954022 -0.0203083 -0.0940748 0.076668 -0.6090772 -0.0145093 -0.002549 -0.0270963 -0.414125 -0.0433966 -0.0126093 -0.0431623 -0.3204218 1.0533799 -0.1164303 -0.1360391 -0.233105 0.559237 -0.0539511 -0.166028 -0.1444147 0.8370567 1.4857092 -0.4633739 0.4952684 -0.5200556 0.8392039 -0.6649146 0.5039325 -0.670778 0.6901599 0.0137927 0.3253556 0.1986715 0.1129566 1.8597225 0.3070357 0.4088879 0.3326333 0.6169125 -0.7765189 0.0039064 0.0287643 0.4426661 -0.8567342 0.54193 -0.3189959 0.5422331 -0.810878 -1.5122488 0.4385338 -0.3920357 0.0450674 -0.4860343 0.2151587 -0.0684324 0.1917708 -0.4792939 -0.4221 -0.2628975 -0.2064876 -0.0159572 -0.9687025 -0.1032506 -0.3574604 -0.5615572 -0.8566629 -0.3026305 0.0125892 -0.0710614 -0.0132459 -1.4236318 -0.1557949 -0.1462474 0.3568146 -0.484262 -0.1760052 0.0205833 0.0406138 0.0561955 -0.2012168 -0.0717012 0.0661774 -0.0257287 -0.2461131 unknown
polarizability: 221.0143209|15.8650329|213.6050574|13.2725831|25.1723322|124.3512601 unknown
InChI: InChI=1/C9H7BN3O4/c14-12(15)10(13(16)17)8-5-1-3-7-4-2-6-11-9(7)8/h1-6,10H
charge -1 multiplicity 1
24 atoms
C  0.11638155 1.79546886 0.43448277
C  0.08407875 0.50494181 -0.04753091
C  -1.20184041 -0.0910952 -0.24291651
C  -2.38536501 0.64910338 0.04367379
C  -2.28474995 1.97464325 0.52843646
C  -1.05190643 2.53420477 0.7196804
H  1.07539673 2.27298098 0.60173939
C  -3.63535524 0.01807075 -0.16051036
H  -3.19316231 2.52811329 0.74642508
H  -0.96404937 3.54827595 1.09513901
C  -3.67391087 -1.26789383 -0.61858631
C  -2.4463694 -1.92209225 -0.87147591
H  -4.5479876 0.56688118 0.05284678
H  -4.61051255 -1.78644492 -0.78647078
H  -2.45282006 -2.94764236 -1.23586887
N  -1.27073874 -1.37644925 -0.69830568
B  1.43132197 -0.32231347 -0.32518377
N  2.62443468 0.5904317 -0.88239014
N  1.94371434 -0.91141036 1.08204669
O  2.35892681 1.47773642 -1.68663526
O  3.78137061 0.31237779 -0.59429747
O  2.30787614 -0.13029891 1.95409234
O  1.90092227 -2.11914329 1.27741865
H  1.35511909 -1.21659628 -1.11444438
