program: Gaussian 16
title: QHBOH-H- retry
version: ES64L-G16RevC.01
method: RwB97XD
basis: GenECP
operation: Freq
keyword: #N
keyword: Geom=AllCheck
keyword: Guess=TCheck
keyword: SCRF=Check
keyword: GenChk
keyword: RwB97XD/GenECPFreq
converged: YES YES YES YES
title: Mulliken charges:
elementType: C H C N N N B C H H H H O H O H
charge: -0.434391 0.201094 -0.291696 0.257536 -0.160538 -0.231103 0.422099 -0.397109 0.178984 0.182888 0.183826 -0.200792 -0.565883 0.224640 -0.618926 0.249371
chargesum: -1.00000
title: Mulliken charges with hydrogens summed into heavy atoms:
elementType: C C N N N B C O O
charge: -0.233297 -0.291696 0.257536 -0.160538 -0.231103 0.221307 0.148589 -0.341243 -0.369555
1716.lowfreq: -5.4371 0.0004 0.0004 0.0006 13.1364 35.8153 70.5778 87.1268 121.4932
frequency: 62.4568 86.3415 121.4273 164.6720 224.2715 308.0586 331.6913 362.3493 378.8896 445.5678 500.0886 619.7969 676.3443 735.0885 765.1592 829.5846 861.3272 906.7568 1002.7016 1031.7266 1037.4234 1062.4425 1081.9286 1148.5092 1151.3209 1157.7187 1213.6326 1278.8219 1312.2067 1375.3986 1452.6958 1474.0202 1490.3234 1519.8046 1568.1739 2146.7531 3056.6812 3128.0165 3170.0739 3288.3834 3946.8991 3955.0311
redmass: 2.0938 1.8487 3.7105 4.3294 3.5339 2.1091 1.7033 2.2386 1.5395 4.3043 4.1616 3.9011 6.1740 4.7838 3.0207 1.6540 2.7321 2.9264 1.2583 1.5097 3.2768 2.0651 3.6804 1.3829 1.3210 1.6074 1.7424 9.5123 4.2983 5.2759 1.3568 2.6454 1.0391 1.3221 5.2937 1.0714 1.0342 1.1057 1.1021 1.0989 1.0660 1.0652
irintensity: 5.2718 8.2537 1.9342 7.4260 1.5274 38.5246 62.8070 24.4827 119.7199 30.4934 19.5069 12.6649 5.7872 0.7580 45.6129 68.5066 72.0833 166.5695 274.2902 160.7424 63.6783 33.8355 26.3742 40.7185 7.5584 48.5636 232.3034 84.6277 18.1439 2.3123 8.0747 12.5348 11.9201 14.5054 19.7916 712.1274 72.4179 23.3677 6.6115 0.4556 15.0840 13.1790
temp: 298.150 k
press: 1.00000 atm
elementType: 6 1 6 7 7 7 5 6 1 1 1 1 8 1 8 1
symmnumber: 1
zpe: 313604.4 jmol-1
zpe.correction: 0.119446 hartree
zpe.thermalcorrener: 0.128582 hartree
zpe.thermalcorrenthalpy: 0.129526 hartree
zpe.thermalcorrgfe: 0.084947 hartree
zpe.sumelectzpe: -458.086423 hartree
zpe.sumelectthermal: -458.077287 hartree
zpe.sumelectthermalent: -458.076343 hartree
zpe.sumelectthermalfe: -458.120922 hartree
dipole: -16.2520 4.0889 -7.3988
dipole: 18.3191
quadrupole: -126.1597 -46.9894 -75.0930
quadrupole: 11.8814 -29.0229 0.6708
quadrupole: -43.4123 35.7580 7.6543 11.8814 -29.0229 0.6708
hfenergy: -458.2058691 hartree
pointgroup: C01 [X(C3H7B1N3O2)]
dipole: -0.8592866 3.2135357 -1.1562046 debye
dipolederiv: -0.0647492 -0.2502591 0.0839451 0.1333463 0.1381806 -0.031463 -0.016274 -0.1426261 -0.0850648 0.0660938 -0.0805596 -0.0195939 -0.087013 0.0493598 0.0120434 -0.0200069 0.0094718 0.1858092 -0.2552004 -0.0980503 -0.0460631 -0.1317893 -0.2349398 -0.0079989 0.0384572 -0.0723114 -0.1536503 0.1416895 0.1431728 0.0214549 0.1377093 -0.8896045 0.2432562 0.0239528 0.2641038 -0.1388108 -0.6665644 0.214015 -0.1863049 0.2967142 0.4186113 -0.0674051 -0.2148776 -0.0916617 -0.2612603 0.0442347 0.2926647 0.0393002 -0.1469357 -0.5957718 0.0304457 0.1460896 0.151671 -0.2914785 1.431766 0.0256071 0.0404467 0.0540948 1.3987571 -0.1379821 0.0430979 -0.1362584 1.4510363 0.1905489 -0.1416906 -0.0025768 -0.0963816 0.6689543 -0.1131462 -0.0119994 -0.1376905 0.3321529 0.0088087 -0.0521999 0.1194715 0.0314707 -0.0534441 0.0474946 0.0711405 0.1220489 -0.0459323 -0.0510109 0.0683983 -0.0728518 -0.0482979 0.0542537 -0.0053326 -0.0446096 0.0338435 0.0798025 0.0878323 0.0027855 -0.0283514 0.0343493 -0.1341749 -0.0101572 -0.0071446 -0.1261658 -0.0551207 -0.2951358 0.0707691 -0.0134046 0.0685086 -0.6669394 -0.2102269 0.0152375 -0.2063714 -0.4409263 -0.7325619 0.1550199 0.1787348 0.114413 -0.8270739 0.279229 0.1823488 0.4379726 -1.4429142 0.1939727 -0.1375376 -0.0171312 -0.1235584 0.2566308 -0.0269071 -0.0559366 -0.0923818 0.2972275 -1.3517421 -0.2665473 -0.0396174 -0.3515729 -0.7634796 -0.1018808 -0.0502109 -0.092904 -0.7238852 0.2520182 0.0544118 -0.0574581 0.1149425 0.1806805 0.1000312 -0.0992649 0.0792594 0.2930151 unknown
polarizability: 101.4120042|-4.2395302|114.842918|9.3686743|-10.0851786|81.0255974 unknown
InChI: InChI=1/C3H7BN3O2/c1-7-2-3(4(8)9)5-6-7/h2,4,8-9H,1H3
charge -1 multiplicity 1
16 atoms
C  3.19686346 1.75161798 0.62237465
H  4.05319847 2.39824867 0.72055351
C  3.02856662 0.41377601 0.90656158
N  2.00538712 2.18921406 0.15225106
N  1.11951839 1.18767431 0.13576181
N  1.72628995 0.12567931 0.58419478
B  4.09510451 -0.65277095 1.51482966
C  1.62834016 3.51185977 -0.28891221
H  2.27520925 3.84005359 -1.10491858
H  0.59937108 3.46175565 -0.64184326
H  1.69368836 4.22505725 0.53550976
H  4.14907103 -1.65289474 0.76164933
O  3.71526138 -1.10327471 2.89218865
H  3.02867442 -1.76483774 2.81758917
O  5.39387492 0.05305371 1.60118646
H  6.0047858 -0.52424191 2.05731635
