program: Gaussian 16
title: Me_Ph-H-
version: ES64L-G16RevC.01
method: RwB97XD
basis: GenECP
operation: Freq
keyword: #N
keyword: Geom=AllCheck
keyword: Guess=TCheck
keyword: SCRF=Check
keyword: GenChk
keyword: RwB97XD/GenECPFreq
converged: YES YES NO YES
title: Mulliken charges:
elementType: C C C C C C H H H H N B C C C C C C H H C C C C C C H H C H H H C H H H H H H H H H H
charge: -0.304135 0.056994 -0.499922 -0.648022 0.032611 -0.416707 0.183313 0.209792 0.135359 0.192996 0.516582 -0.080209 -0.155482 -0.165977 -0.001918 -0.142389 -0.359593 -0.544034 0.204806 0.201330 0.589218 -0.263292 -0.294761 -0.174992 -0.377197 -0.487176 0.199298 0.196973 -0.366971 0.119647 0.142567 0.179702 -0.296521 0.169385 0.117970 0.152567 -0.154572 0.174301 0.204195 0.203253 0.173121 0.207643 0.170251
chargesum: -1.00000
title: Mulliken charges with hydrogens summed into heavy atoms:
elementType: C C C C C C N B C C C C C C C C C C C C C C
charge: -0.120822 0.266786 -0.499922 -0.648022 0.167970 -0.223711 0.516582 -0.234781 -0.155482 0.007144 0.205724 0.062418 -0.158263 -0.373784 0.589218 -0.059097 -0.091509 0.024306 -0.180224 -0.312875 0.074944 0.143401
1716.lowfreq: -20.2226 0.0004 0.0005 0.0006 11.1818 19.4491 28.1625 34.7571 49.7046
frequency: 21.3308 32.8563 49.1529 51.7334 60.4543 70.5440 91.2111 123.5917 162.1041 204.4169 220.7344 232.4147 244.2415 258.5342 271.1289 296.2397 313.6830 341.7202 385.4227 408.4353 415.9626 463.7714 477.7225 494.9242 504.7022 553.4535 584.1773 605.0451 612.0821 636.1299 638.4072 648.5189 717.7859 721.0603 723.7582 744.1536 755.6597 777.0629 787.7212 813.4515 820.5470 831.4019 869.8550 880.9180 893.3763 934.6167 935.6746 965.1426 993.7390 998.9637 1000.1563 1005.0898 1005.6487 1015.0275 1018.8133 1019.8021 1057.6637 1058.9740 1062.0487 1074.2364 1084.3006 1088.4175 1101.0875 1105.6367 1119.5849 1125.8119 1153.7528 1171.5457 1172.8519 1174.4629 1180.9131 1181.5095 1189.6782 1194.7803 1212.8563 1217.9649 1260.8930 1304.8396 1310.3618 1314.1110 1327.1812 1354.1316 1357.9796 1365.4499 1441.3409 1464.9762 1466.6993 1468.7006 1477.0937 1480.5063 1493.2049 1501.6575 1518.9380 1522.2350 1522.8075 1529.7524 1628.8155 1631.0885 1631.7762 1648.9914 1652.9296 1655.4938 2334.4893 2905.7114 2914.9407 3057.2787 3059.4435 3119.0275 3142.6363 3144.2199 3150.3965 3153.5602 3158.9960 3159.0664 3163.4461 3165.1080 3170.3752 3172.8930 3174.1951 3185.8481 3187.9506 3188.3223 3195.2891
redmass: 3.8395 3.8769 4.6612 4.2331 3.9664 4.3498 3.1555 3.4638 3.3690 4.1594 4.4822 4.2350 2.0029 2.0741 4.1838 2.3660 1.0683 3.3595 2.8264 2.8862 2.8328 3.7167 3.8076 3.5231 4.0566 3.7274 3.2424 5.0281 4.6428 5.8688 6.3640 5.2630 2.7814 1.5960 1.5158 2.9766 1.9392 2.4550 2.5884 3.0448 3.1311 3.1707 1.2580 1.2591 1.5607 1.4390 1.4586 1.3905 3.0921 1.3226 1.3840 1.2961 1.2995 1.3596 6.1307 5.3773 2.4211 2.2497 1.8642 1.4489 2.0872 1.5117 1.7108 1.4649 2.0528 1.2831 2.0044 1.1802 1.1865 1.8537 1.4172 1.9158 1.7248 1.6644 1.1607 1.2397 3.4915 3.4502 3.7672 4.0780 2.3196 1.4497 1.4148 2.7615 1.1619 1.3497 2.1666 2.1787 1.7588 1.0649 1.0519 1.1880 1.5654 2.1111 2.1490 1.3011 5.6045 5.5250 5.5000 5.5588 5.7360 5.7421 1.0827 1.0615 1.0612 1.0775 1.0712 1.1014 1.0856 1.0857 1.0847 1.0851 1.0846 1.0945 1.0905 1.0904 1.0936 1.0940 1.0893 1.0922 1.0985 1.0985 1.0964
irintensity: 0.2014 0.2646 0.5362 0.1952 0.2175 0.9977 1.8153 1.1949 2.2897 1.2374 0.6284 0.0488 0.9786 1.2282 0.4037 4.6947 1.5297 0.7774 3.0960 0.0371 0.1447 0.7843 2.1065 6.7197 4.2389 14.6931 9.9205 10.2364 16.2859 1.3179 0.8237 3.6305 23.0504 73.4335 56.9507 27.6779 31.0046 20.7978 30.8418 2.0251 7.0970 1.0551 0.1393 0.0378 2.1506 1.8024 5.8378 4.6873 48.1646 1.0716 0.0143 0.7396 0.1316 0.5682 0.3862 0.7305 29.2400 38.1891 47.0538 29.5907 11.4452 8.4983 18.5567 7.5490 16.5365 11.4841 6.8018 1.6929 1.4340 9.8570 12.6329 18.3388 22.4250 40.9812 6.0138 8.6622 25.7793 16.6151 19.2429 4.6652 21.8859 0.3551 0.4632 55.4509 1.7942 15.8362 6.6702 5.0693 24.1912 9.3624 25.6577 20.9005 19.4003 7.8133 16.6086 50.4806 10.6772 1.5014 1.5773 44.8392 19.6536 10.6899 316.5847 133.0458 296.7478 77.6539 47.2310 30.8330 14.9908 15.5037 3.5467 2.1989 2.0135 4.2632 15.4205 20.5874 88.9820 90.9012 23.9049 49.4969 84.6037 42.8393 44.5530
temp: 298.150 k
press: 1.00000 atm
elementType: 6 6 6 6 6 6 1 1 1 1 7 5 6 6 6 6 6 6 1 1 6 6 6 6 6 6 1 1 6 1 1 1 6 1 1 1 1 1 1 1 1 1 1
symmnumber: 1
zpe: 943061.1 jmol-1
zpe.correction: 0.359193 hartree
zpe.thermalcorrener: 0.378381 hartree
zpe.thermalcorrenthalpy: 0.379325 hartree
zpe.thermalcorrgfe: 0.310115 hartree
zpe.sumelectzpe: -854.037296 hartree
zpe.sumelectthermal: -854.018109 hartree
zpe.sumelectthermalent: -854.017165 hartree
zpe.sumelectthermalfe: -854.086374 hartree
dipole: -14.8535 -10.7472 -2.3841
dipole: 18.4882
quadrupole: -201.6981 -167.9338 -147.9875
quadrupole: -32.0119 -4.9745 0.2480
quadrupole: -29.1583 4.6060 24.5523 -32.0119 -4.9745 0.2480
hfenergy: -854.3964894 hartree
pointgroup: C01 [X(C20H21B1N1)]
dipole: -0.7706649 0.3281933 -0.7128431 debye
polarizability: 302.9599087|0.4542043|310.333651|5.0967579|-36.3085648|303.3249147 unknown
InChI: InChI=1/C20H21BN/c1-22(2)20-16-10-9-15-19(20)21(17-11-5-3-6-12-17)18-13-7-4-8-14-18/h3-16,21H,1-2H3
charge -1 multiplicity 1
43 atoms
C  -0.38735802 0.76329051 0.71350361
C  0.93487275 1.1221341 0.97738749
C  1.49317341 2.3508125 0.60501485
C  0.61403506 3.25399275 -0.04558823
C  -0.70961405 2.89784597 -0.32131891
C  -1.21471234 1.65451686 0.04931119
H  -0.75706804 -0.2132481 1.01256848
H  1.57417654 0.39568655 1.47039782
H  -1.36228828 3.59993829 -0.82978612
H  -2.24467433 1.39627568 -0.17812682
N  1.09963809 4.53155423 -0.45167933
B  3.09364679 2.66285178 0.80955854
C  3.85105117 1.39946202 1.52215035
C  4.40470763 0.32829209 0.80559373
C  3.94467901 1.31079403 2.91963382
C  5.00194206 -0.76277359 1.43277417
C  4.53770864 0.22844879 3.56482756
C  5.07063729 -0.8210115 2.82147478
H  5.41757357 -1.57004419 0.83566846
H  4.58618512 0.20253541 4.65021199
C  3.78786661 3.01813845 -0.62230496
C  3.40298048 2.40456948 -1.82419152
C  4.84393923 3.93484631 -0.71473076
C  4.02003426 2.6884901 -3.03904379
C  5.47128714 4.23494967 -1.92144286
C  5.06094423 3.61177425 -3.0965228
H  3.68578678 2.19286639 -3.9467797
H  6.28199636 4.9584615 -1.94732798
C  0.50270167 5.12485203 -1.62289989
H  -0.50570316 5.54886717 -1.44971635
H  1.14422999 5.94116032 -1.96976834
H  0.43358189 4.38476204 -2.42311676
C  1.26653233 5.48950937 0.62155893
H  1.90103805 6.31579104 0.28290674
H  0.29830082 5.91112295 0.95396936
H  1.75454762 5.01301477 1.46947971
H  3.24933927 3.62338386 1.56409773
H  5.54306231 3.84233775 -4.04173726
H  2.57768915 1.69586332 -1.80751668
H  5.17528721 4.43483663 0.1926156
H  4.36949718 0.35042249 -0.28064253
H  3.53368829 2.1204436 3.5185321
H  5.53643963 -1.66774112 3.31627021
