program: Gaussian 16
title: MeQHBPh2-H-
version: ES64L-G16RevC.01
method: RwB97XD
basis: GenECP
operation: Freq
keyword: #N
keyword: Geom=AllCheck
keyword: Guess=TCheck
keyword: SCRF=Check
keyword: GenChk
keyword: RwB97XD/GenECPFreq
converged: YES YES YES YES
title: Mulliken charges:
elementType: C H C N N N B C H H H C C C C C C C C C C C C H H H H H H H H H H H
charge: -0.546878 0.227286 -0.723302 0.355284 0.076914 -0.240535 0.341500 -0.337231 0.192992 0.176983 0.181491 0.439488 -0.293255 -0.368671 -0.349259 -0.021582 -0.550302 0.463580 -0.445895 -0.228391 -0.416933 0.052178 -0.517191 -0.366915 0.211085 0.159970 0.171749 0.201849 0.198924 0.177262 0.204985 0.169854 0.191139 0.211826
chargesum: -1.00000
title: Mulliken charges with hydrogens summed into heavy atoms:
elementType: C C N N N B C C C C C C C C C C C C C
charge: -0.319591 -0.723302 0.355284 0.076914 -0.240535 -0.025416 0.214235 0.439488 -0.094331 -0.208701 -0.147410 0.189503 -0.378553 0.463580 -0.234069 -0.051129 -0.225793 0.257162 -0.347337
1716.lowfreq: -0.0005 -0.0003 0.0004 21.3073 27.7626 30.2410 36.3137 63.8061 64.7771
frequency: 34.6902 63.7335 64.4867 69.0603 82.2394 94.5684 103.6255 178.4639 192.7337 226.1076 252.9232 264.2475 275.3595 316.7059 408.8241 421.7285 424.5838 488.4602 512.5624 595.3647 625.3729 634.5707 639.9800 651.1264 689.4128 726.0568 731.6258 736.9604 748.6391 761.7920 797.2113 806.7831 821.5561 850.9070 876.7766 889.0841 936.8325 948.2634 1004.1483 1009.3811 1014.3074 1015.4159 1021.7247 1022.1770 1033.5928 1050.3093 1054.5339 1060.6302 1067.0842 1073.2043 1088.6299 1103.7925 1113.1712 1149.4477 1157.4542 1172.4822 1175.8547 1178.6978 1194.5652 1214.1715 1230.3587 1273.3341 1307.5141 1314.0864 1317.0162 1355.4720 1368.2835 1370.7456 1448.0965 1466.9306 1469.6545 1471.1911 1487.9403 1518.0307 1522.9375 1530.8740 1564.2838 1632.5296 1634.6392 1653.9852 1658.1497 2330.8967 3056.4459 3128.1913 3149.2274 3152.5944 3153.0223 3158.9248 3165.9313 3169.7693 3172.4582 3172.7137 3177.4816 3188.8764 3190.6171 3279.2304
redmass: 1.3018 3.8614 3.3950 4.5224 4.2982 3.8274 4.3370 3.3880 4.3851 4.4925 5.4490 5.0257 4.8741 5.9015 3.5569 2.8962 2.8582 3.6716 3.3927 5.3941 4.5567 5.4186 6.3957 4.2340 5.7191 1.3874 3.3298 1.7467 3.5284 3.0809 2.6655 2.7954 3.0124 1.5181 1.2632 1.2640 1.4474 1.3889 1.3434 1.5224 1.7055 1.3300 5.2071 5.3771 1.4347 2.3563 2.2301 2.2142 2.1368 1.7397 3.3591 1.5942 1.6277 1.3171 2.3261 1.1130 1.1183 2.1258 2.4809 1.1869 1.2227 9.5377 4.5738 4.4211 4.7985 1.4547 3.3281 1.6232 1.3748 2.1884 2.2012 2.5973 1.0394 1.3091 2.1571 2.0916 5.1327 5.4784 5.3824 5.7447 5.6152 1.0827 1.0343 1.1057 1.0840 1.0832 1.0861 1.0862 1.0904 1.1022 1.0944 1.0904 1.0938 1.0987 1.0986 1.0991
irintensity: 2.5561 2.1184 2.4995 5.4457 1.9744 0.1082 3.5709 0.1461 3.8538 0.6189 1.4265 3.1964 0.7625 1.1794 5.4581 0.0239 0.0526 4.6190 6.9692 5.0281 13.3848 1.0074 0.2131 2.1832 3.2203 84.6310 26.4757 49.3743 12.8114 27.6531 6.7624 5.8284 6.2619 24.5449 0.0945 0.0166 7.7586 6.0499 0.5166 21.0112 18.7768 2.2540 0.8856 4.3072 0.9056 39.1594 92.7108 7.1617 0.2245 9.1025 8.4020 7.7281 8.5613 0.2617 3.7046 0.5000 1.3664 25.2135 43.5070 7.0041 10.2306 50.0226 16.5006 8.2437 22.0926 0.8349 15.5780 6.2599 10.4201 7.2164 2.7232 22.9281 12.0969 20.7944 10.9668 11.2663 13.4520 0.5317 1.5650 19.0057 9.9610 360.5980 73.7398 19.9155 10.0935 8.5103 1.9895 1.1294 8.0252 6.0431 100.5356 15.4885 109.9920 59.2000 42.4676 0.5580
temp: 298.150 k
press: 1.00000 atm
elementType: 6 1 6 7 7 7 5 6 1 1 1 6 6 6 6 6 6 6 6 6 6 6 6 1 1 1 1 1 1 1 1 1 1 1
symmnumber: 1
zpe: 718720.2 jmol-1
zpe.correction: 0.273746 hartree
zpe.thermalcorrener: 0.289466 hartree
zpe.thermalcorrenthalpy: 0.290410 hartree
zpe.thermalcorrgfe: 0.229218 hartree
zpe.sumelectzpe: -769.469763 hartree
zpe.sumelectthermal: -769.454043 hartree
zpe.sumelectthermalent: -769.453099 hartree
zpe.sumelectthermalfe: -769.514291 hartree
dipole: -16.3030 6.1630 -10.2188
dipole: 20.2038
quadrupole: -199.5652 -113.6234 -144.1883
quadrupole: 21.5630 -37.1077 9.5394
quadrupole: -47.1063 38.8355 8.2707 21.5630 -37.1077 9.5394
hfenergy: -769.7435094 hartree
pointgroup: C01 [X(C15H15B1N3)]
dipole: 1.5278969 2.4106684 -0.3487841 debye
polarizability: 250.6013907|-8.2687368|228.6530754|-18.7224341|-17.9829361|261.5218127 unknown
InChI: InChI=1/C15H15BN3/c1-19-12-15(17-18-19)16(13-8-4-2-5-9-13)14-10-6-3-7-11-14/h2-12,16H,1H3
charge -1 multiplicity 1
34 atoms
C  3.40318024 1.464173 0.45109164
H  4.37066671 1.9154131 0.29862708
C  3.03203319 0.25179062 0.99579025
N  2.2566739 2.07745665 0.07498736
N  1.20567889 1.30377128 0.36289726
N  1.66000877 0.21524411 0.91193752
B  3.95298208 -0.9283394 1.61486095
C  2.07564823 3.35923703 -0.56606573
H  1.00484113 3.52909576 -0.66833991
H  2.51205922 4.15397672 0.04201122
H  2.53894676 3.36306617 -1.55496916
C  5.51769806 -0.56066021 1.31734979
C  6.1326157 -0.92944182 0.11152494
C  6.30255633 0.19629798 2.19976723
C  7.43883488 -0.56479785 -0.20409029
C  7.61082527 0.57120567 1.9007811
C  8.18816063 0.19303939 0.69212814
C  3.7072473 -1.14535287 3.21083758
C  4.20215985 -2.29629281 3.84558259
C  3.06469816 -0.21795096 4.04045116
C  4.06977125 -2.51198608 5.21262894
C  2.92240079 -0.41682368 5.41362313
C  3.42548854 -1.56755967 6.00966053
H  3.6839801 -1.97831313 1.02863098
H  8.18371733 1.15771616 2.6139266
H  5.87392108 0.49712183 3.15301936
H  9.20827279 0.47877625 0.45464198
H  7.87633263 -0.87453079 -1.14936083
H  5.56103952 -1.52153022 -0.59928655
H  2.65217832 0.68444585 3.59727987
H  2.41262454 0.32797796 6.01888129
H  3.31635918 -1.72941868 7.07778034
H  4.46768016 -3.41812614 5.66147787
H  4.71113945 -3.04334584 3.23989804
