program: Gaussian 16
title: Me_bicyclo-H2
version: ES64L-G16RevC.01
method: RwB97XD
basis: GenECP
operation: Freq
keyword: #N
keyword: Geom=AllCheck
keyword: Guess=TCheck
keyword: SCRF=Check
keyword: GenChk
keyword: RwB97XD/GenECP
keyword: Freq
converged: YES YES YES YES
title: Mulliken charges:
elementType: H C C C C H C H C H C H H H C H H H N H H B C C C H C C H C C H H H H C H H H H H H H H
charge: 0.223816 -0.308147 0.058537 -0.552051 0.009068 0.184501 -0.137017 0.232777 -0.127797 0.207673 -0.351986 0.210234 0.232552 0.211979 -0.355540 0.202556 0.216996 0.248559 0.133350 -0.008463 0.239979 -0.829423 0.307783 0.504178 -0.577378 0.215597 -0.556946 -0.736550 0.100153 -0.557543 -0.183538 0.172831 0.088210 0.160100 0.144345 -0.238184 0.169690 0.139698 0.130164 0.151162 0.184510 0.134501 0.114873 0.190191
chargesum: -0.00000
title: Mulliken charges with hydrogens summed into heavy atoms:
elementType: C C C C C C C C N B C C C C C C C C
charge: -0.084330 0.243038 -0.319274 0.009068 0.070655 -0.127797 0.302779 0.312571 0.373330 -0.837886 0.523379 0.604331 -0.316336 -0.252502 -0.427161 -0.276218 0.135473 0.066880
1716.lowfreq: -0.0003 0.0004 0.0006 6.3939 9.8855 10.5693 28.2986 69.1102 87.2240
frequency: 27.7499 69.1041 87.1802 101.8047 119.2616 157.0820 166.4615 203.7774 216.7867 232.4789 246.3016 252.5604 293.9899 333.5668 340.2434 353.4525 364.6918 381.5132 405.3578 485.4505 505.0506 516.6120 525.3817 573.8015 596.0150 598.9342 639.2644 706.5690 732.8835 760.1727 765.3558 775.9209 788.5766 796.7500 827.1449 840.8439 860.6443 883.1997 890.8644 902.6346 937.8581 952.7417 956.8428 974.4964 977.9013 1013.1157 1016.4297 1019.9780 1045.8339 1057.6233 1071.7799 1079.3304 1092.7037 1099.1313 1102.1297 1125.4744 1134.7043 1138.1184 1155.6309 1157.2212 1170.6754 1189.7645 1201.6382 1203.9694 1227.0275 1237.2448 1258.6351 1273.2636 1278.7459 1286.9368 1307.0038 1313.5428 1324.2633 1328.2381 1334.6257 1344.2650 1357.8107 1375.7429 1380.4780 1387.7225 1391.3723 1397.3891 1439.0983 1449.8426 1476.5229 1478.5243 1481.8861 1485.0230 1487.6790 1490.4961 1491.8144 1496.7090 1501.5477 1507.7942 1513.8497 1515.2693 1534.7762 1540.5703 1637.2387 1676.5774 2063.2262 2954.1498 2966.2645 2984.1041 2988.4586 2993.7295 2997.6040 3004.5826 3023.2239 3030.0895 3034.5759 3037.0003 3041.3262 3065.1695 3078.2411 3083.0723 3085.3841 3111.2104 3171.7448 3176.6445 3182.3051 3187.1926 3189.6133 3195.0230 3211.6949 3224.8968
redmass: 3.6416 3.7191 3.0994 2.7415 3.1724 2.4905 3.0089 3.4127 1.5052 1.7297 1.9357 1.3886 2.1119 3.0334 2.4217 3.2392 2.9014 2.3542 2.1333 2.9408 2.3198 3.3197 3.5490 3.3752 3.3970 4.1768 4.5127 2.2208 1.7485 3.8285 2.2864 1.9572 2.5284 3.1400 2.7718 2.0812 1.4828 1.5775 1.7908 1.7728 1.7040 2.9633 2.8624 1.3851 1.6676 1.8078 1.8072 1.3495 1.8241 1.9880 2.2740 1.2744 2.1294 2.4390 1.9661 1.4921 1.3000 1.4727 1.0619 1.8234 1.6853 1.1653 2.0492 1.6999 1.6041 1.6450 1.4084 1.4357 1.7458 1.2669 1.7064 1.5388 1.7875 2.3262 1.3246 1.3540 1.3298 1.3631 1.3488 1.3895 1.4849 1.4731 1.3278 1.1501 1.2902 1.0894 1.1120 1.2114 1.3843 1.1504 1.0947 1.1095 1.1173 1.0961 1.1884 1.2842 1.0861 1.3630 5.2008 5.6568 1.0733 1.0829 1.0760 1.0721 1.0630 1.0701 1.0682 1.0781 1.1003 1.0987 1.0770 1.0831 1.0814 1.0848 1.0318 1.0340 1.0954 1.0891 1.1071 1.1059 1.0890 1.1011 1.0960 1.1066 1.0963 1.0921
irintensity: 2.4639 0.7049 1.9754 1.2779 3.8881 1.6745 11.0131 1.8558 1.0566 2.8762 0.1894 2.1224 1.5800 1.9558 4.0253 1.5308 1.4869 0.3425 0.1158 9.0554 5.0897 10.2123 3.1282 9.3003 2.0711 0.1804 1.9148 5.5592 11.2895 0.7021 20.2301 25.9185 10.2127 2.5094 0.1197 0.3823 1.5223 1.8640 2.8665 1.3854 12.9376 7.5502 21.8070 0.2174 8.0382 0.1815 0.0422 0.0690 12.2188 12.1812 12.9858 5.0212 2.3345 16.2370 1.2379 0.3484 12.1394 3.0195 0.5432 11.4302 2.3286 0.4996 6.0260 22.7772 10.5082 12.9199 4.9015 46.4281 35.9807 2.1582 41.0798 4.0464 14.2808 29.0882 32.7100 11.2147 0.2599 6.1050 0.8485 0.0646 1.4666 0.5666 140.7826 7.5135 0.0747 2.2624 2.3282 21.4918 2.1857 10.9379 0.9306 2.7690 9.6095 20.1692 50.2769 10.8619 12.4044 35.1771 13.9830 4.4719 529.5790 764.9903 313.9983 60.5398 68.6176 29.2185 347.6731 103.1238 58.3615 107.3880 109.5477 79.4726 47.1374 20.5043 6.7186 5.6898 112.3390 111.9433 2.2079 13.2513 1.5555 2.7574 14.6194 2.5673 18.9167 17.3876
temp: 298.150 k
press: 1.00000 atm
elementType: 1 6 6 6 6 1 6 1 6 1 6 1 1 1 6 1 1 1 7 1 1 5 6 6 6 1 6 6 1 6 6 1 1 1 1 6 1 1 1 1 1 1 1 1
symmnumber: 1
zpe: 1048470.5 jmol-1
zpe.correction: 0.399341 hartree
zpe.thermalcorrener: 0.415852 hartree
zpe.thermalcorrenthalpy: 0.416797 hartree
zpe.thermalcorrgfe: 0.356072 hartree
zpe.sumelectzpe: -704.508234 hartree
zpe.sumelectthermal: -704.491723 hartree
zpe.sumelectthermalent: -704.490779 hartree
zpe.sumelectthermalfe: -704.551503 hartree
dipole: 3.2258 -9.1838 -1.1054
dipole: 9.7964
quadrupole: -77.3946 -139.6941 -117.0859
quadrupole: -45.5297 -8.0931 0.7927
quadrupole: 33.9969 -28.3025 -5.6944 -45.5297 -8.0931 0.7927
hfenergy: -704.9075753 hartree
pointgroup: C01 [X(C16H26B1N1)]
dipole: 1.2691245 -3.6131822 -0.4348796 debye
polarizability: 244.8444552|7.4533616|268.9707872|-15.4646562|-0.7419525|192.4743276 unknown
InChI: InChI=1/C16H26BN/c1-18(2)16-12-4-3-11-15(16)17-13-7-5-8-14(17)10-6-9-13/h3-4,11-14,17-18H,5-10H2,1-2H3
charge 0 multiplicity 1
44 atoms
H  0.53000622 0.24171088 1.12493385
C  1.57144584 0.17814616 0.82736218
C  2.33460302 1.33666431 0.74302317
C  2.12952413 -1.06250791 0.53465429
C  3.68654288 1.3325349 0.36240623
H  1.8618344 2.28009709 0.98356973
C  3.46541017 -1.12670251 0.16703666
H  1.53658229 -1.96744763 0.59570254
C  4.18789197 0.05514051 0.09368701
H  3.92405869 -2.08444427 -0.05714849
C  5.86126214 -0.44966777 -1.66849698
H  5.22581057 0.13153653 -2.33238442
H  6.91066203 -0.28738787 -1.9142433
H  5.61823285 -1.50858256 -1.75303116
C  6.4427981 -0.74182442 0.71237956
H  6.15286847 -1.7914684 0.71693934
H  7.49310191 -0.64529686 0.43815797
H  6.26925626 -0.30201194 1.69290388
N  5.61949776 -0.00138458 -0.27599347
H  5.80658743 2.28203325 0.56336005
H  5.88837691 1.010757 -0.17247745
B  4.65378625 2.64020123 0.18714157
C  4.32029608 3.99735565 1.02977892
C  4.76556612 3.12629026 -1.37583368
C  3.04514376 4.71790935 0.53613311
H  4.16690476 3.7790791 2.09664386
C  5.56234661 4.90626861 0.9330741
C  3.41058712 3.7030399 -1.82328935
H  4.97948699 2.29312125 -2.06446552
C  5.95068657 4.10403969 -1.50742522
C  2.91264692 4.89377457 -0.98967804
H  2.97171048 5.70982211 1.00578176
H  2.16881541 4.16906395 0.89532275
H  6.39948017 4.38797825 1.41729951
H  5.40739284 5.83842685 1.49600494
C  5.97052777 5.27414188 -0.50435791
H  3.44627753 4.01018714 -2.87854776
H  2.66785602 2.89581954 -1.76686073
H  6.86942507 3.51875621 -1.36507197
H  6.00665507 4.51731511 -2.52550463
H  1.86113284 5.08559868 -1.23490199
H  3.44869158 5.7924581 -1.30322266
H  5.31873765 6.07307734 -0.8656004
H  6.97722361 5.70912568 -0.49052487
