program: Gaussian 16
title: QHBbicyclo-H2
version: ES64L-G16RevC.01
method: RwB97XD
basis: GenECP
operation: Freq
keyword: #N
keyword: Geom=AllCheck
keyword: Guess=TCheck
keyword: SCRF=Check
keyword: GenChk
keyword: RwB97XD/GenECP
keyword: Freq
converged: YES YES NO YES
title: Mulliken charges:
elementType: C C H C N N N H H H H B C C C H C C H C C H H H H C H H H H H H H H H
charge: -0.387542 -0.922748 0.312425 -0.172653 0.358113 -0.004835 -0.062573 0.446245 0.218812 0.216979 0.217849 0.241725 0.206431 0.203010 -0.597641 0.180304 -0.523496 -0.598626 0.180072 -0.524349 -0.228638 0.133804 0.170330 0.081029 0.173469 -0.356879 0.133914 0.170492 0.082563 0.173676 0.184650 0.113355 0.128459 0.169190 -0.116916
chargesum: -0.00000
title: Mulliken charges with hydrogens summed into heavy atoms:
elementType: C C C N N N B C C C C C C C C
charge: 0.266098 -0.610323 -0.172653 0.358113 -0.004835 0.383672 0.124809 0.386735 0.383082 -0.293507 -0.268998 -0.294220 -0.268110 0.069367 -0.059230
chargesum: 0.00000
1716.lowfreq: -15.0699 -1.3464 -0.0007 -0.0007 -0.0006 7.0173 22.2594 33.8417 66.8037
frequency: 21.2309 33.8103 66.7578 78.8802 153.7510 179.3214 218.0234 230.8693 252.1678 323.8075 330.0057 346.8878 388.2700 407.9776 410.5899 499.0817 521.8139 598.7202 681.4382 685.4575 707.9302 708.3844 739.9950 767.0605 775.1552 791.9038 828.1674 829.0363 833.9962 852.8933 875.1773 891.3159 937.5208 945.4716 968.4282 1011.6342 1015.7246 1047.9465 1061.4038 1083.3802 1091.8099 1093.8245 1095.3980 1123.3365 1132.4076 1138.4790 1142.1980 1156.5500 1159.6303 1174.6354 1215.7746 1231.6294 1240.8468 1258.5656 1288.6549 1311.5483 1313.5422 1322.3205 1335.0570 1343.0367 1357.2898 1374.7738 1383.1141 1387.5645 1388.3137 1398.5687 1401.6302 1450.4663 1456.1820 1478.4848 1480.0830 1484.0935 1486.2910 1494.0157 1497.9617 1506.3266 1519.8083 1527.0718 1596.3205 2280.2183 2978.9803 2979.6021 2991.6106 2992.1956 3001.6342 3003.4197 3021.9738 3025.9512 3032.7357 3033.6195 3040.9426 3041.8189 3081.3036 3087.5654 3109.8177 3177.6841 3201.1657 3311.8283 3649.4389
redmass: 1.0633 3.9518 3.4992 3.3933 2.4411 3.0915 3.3363 5.1750 2.0635 2.9680 2.8164 2.8876 2.0811 2.4263 3.6401 2.1882 2.9983 4.3621 3.6763 4.6976 1.6911 5.0704 2.6939 1.6445 3.9074 1.4108 1.4177 2.8468 2.4777 1.4185 1.5254 1.9478 1.5246 2.8134 1.7491 1.7109 1.8784 3.1421 1.9255 1.7300 2.6440 1.8989 2.2223 1.4666 1.5392 1.5855 1.2388 1.0316 1.3376 1.6123 1.8202 1.6865 2.0253 1.4061 1.2216 1.5602 4.5229 1.9089 1.2364 1.3347 1.3294 1.3643 1.3289 1.3604 1.5725 1.4705 3.5276 2.2495 1.5592 1.0859 1.0871 2.2318 1.0479 1.0914 1.0888 1.0940 1.4508 1.0877 3.4880 1.0834 1.0733 1.0738 1.0641 1.0649 1.0723 1.0736 1.0991 1.0991 1.0704 1.0918 1.0937 1.0776 1.0968 1.0323 1.0890 1.1073 1.1066 1.1007 1.0837
irintensity: 0.0100 0.2372 1.6624 1.8462 0.0918 1.3276 0.2355 3.5248 0.0112 2.3956 1.0805 1.7854 2.1912 2.9279 2.0755 4.1625 3.1002 0.0595 1.2843 6.5366 6.8281 4.5039 6.6188 34.0110 4.5355 50.3932 19.6770 0.2311 1.0614 0.5420 1.8216 1.2416 8.2450 12.2239 2.6596 0.1740 0.0768 25.7409 13.5636 15.2126 37.6599 0.6286 24.4559 0.0077 0.8157 21.6944 8.1085 0.0159 0.0117 43.9901 1.0356 10.3837 113.3008 1.3494 1.4585 3.7718 12.6814 4.2070 0.3977 1.2203 0.0505 1.1446 1.0838 0.2135 6.7354 0.0303 47.6170 12.4288 7.4833 2.4306 2.4572 23.2484 19.1140 6.8817 7.6193 6.0548 4.6097 14.4600 53.8870 403.6807 69.1526 0.5557 73.0396 28.7122 465.3740 1.1879 149.1561 2.2496 198.4729 127.8866 3.2100 19.5745 95.7447 12.7741 101.6616 2.1817 0.1216 4.5924 141.6217
temp: 298.150 k
press: 1.00000 atm
elementType: 6 6 1 6 7 7 7 1 1 1 1 5 6 6 6 1 6 6 1 6 6 1 1 1 1 6 1 1 1 1 1 1 1 1 1
symmnumber: 1
zpe: 819337.3 jmol-1
zpe.correction: 0.312069 hartree
zpe.thermalcorrener: 0.325609 hartree
zpe.thermalcorrenthalpy: 0.326553 hartree
zpe.thermalcorrgfe: 0.270474 hartree
zpe.sumelectzpe: -619.941583 hartree
zpe.sumelectthermal: -619.928044 hartree
zpe.sumelectthermalent: -619.927100 hartree
zpe.sumelectthermalfe: -619.983179 hartree
dipole: 9.1643 3.9108 -1.6564
dipole: 10.1006
quadrupole: -121.8767 -110.7192 -99.1870
quadrupole: -22.9898 13.3498 3.7567
quadrupole: -11.2824 -0.1249 11.4073 -22.9898 13.3498 3.7567
hfenergy: -620.2536526 hartree
pointgroup: C01 [X(C11H20B1N3)]
dipole: 3.605505 1.5386329 -0.6516629 debye
polarizability: 205.9730765|18.3667963|175.6563318|-5.4456615|-17.591527|170.156923 unknown
InChI: InChI=1/C11H20BN3/c1-15-8-11(13-14-15)12-9-4-2-5-10(12)7-3-6-9/h8-10,12-13H,2-7H2,1H3
charge 0 multiplicity 1
35 atoms
C  1.61380559 -0.42756814 0.36700501
C  -0.60870628 -1.49877208 0.90380823
H  -0.20346533 -2.1469817 1.6607524
C  -1.9012094 -1.34658659 0.42662537
N  0.17894296 -0.63124973 0.22085904
N  -0.49032313 0.06678035 -0.65334331
N  -1.71850796 -0.37742103 -0.50937312
H  -2.45208067 0.01140935 -1.08681995
H  2.13216934 -1.35818038 0.14056537
H  1.91398236 0.34817012 -0.33268813
H  1.82862528 -0.11590614 1.38801587
B  -3.36362998 -1.97903494 0.69486581
C  -3.41095626 -3.59170388 0.43368504
C  -3.87205247 -1.77227911 2.23410689
C  -4.88487422 -4.03371867 0.51013689
H  -3.05940107 -3.84526125 -0.57742099
C  -2.49101476 -4.3353966 1.42093548
C  -5.3442449 -2.22159575 2.3044445
H  -3.853799 -0.71128531 2.52412205
C  -2.95135728 -2.51581665 3.22080469
C  -5.61807738 -3.65288131 1.80881524
H  -4.97407045 -5.12053498 0.36536158
H  -5.40907376 -3.56609773 -0.33267943
H  -1.45094345 -4.09990487 1.15603567
H  -2.58166469 -5.42346441 1.29088943
C  -2.71216719 -4.00551833 2.90946608
H  -5.73194961 -2.12751435 3.32959599
H  -5.92755892 -1.52523268 1.68895542
H  -1.983068 -1.9964747 3.23559545
H  -3.33708381 -2.43489067 4.24731129
H  -6.69711648 -3.77437456 1.65528856
H  -5.35898716 -4.36599377 2.5952996
H  -3.55812589 -4.58724892 3.28108502
H  -1.84759274 -4.35736833 3.48631974
H  -4.09966566 -1.38004934 -0.09922528
