program: Gaussian 16
title: Me_Borole-H2
version: ES64L-G16RevC.01
method: RwB97XD
basis: GenECP
operation: Freq
keyword: #N
keyword: Geom=AllCheck
keyword: Guess=TCheck
keyword: SCRF=Check
keyword: GenChk
keyword: RwB97XD/GenECP
keyword: Freq
converged: YES YES YES YES
title: Mulliken charges:
elementType: H C C C H C H C H C H H H C H H H N H H C B C C C H C H H H
charge: 0.220415 -0.500288 -0.237582 -0.399531 0.238718 -0.145514 0.232372 -0.182175 0.185725 -0.380671 0.198272 0.215872 0.218472 -0.346294 0.198774 0.213280 0.245393 0.181450 -0.017535 0.277488 0.384796 -0.213465 -0.411352 -0.415570 -0.210985 0.124367 -0.184480 0.156642 0.173651 0.179758
chargesum: -0.00000
title: Mulliken charges with hydrogens summed into heavy atoms:
elementType: C C C C C C C N C B C C C C
charge: -0.279874 0.001136 -0.167159 0.040212 -0.182175 0.251944 0.311152 0.458938 0.384796 -0.231000 -0.286985 -0.258929 -0.037333 -0.004722
1716.lowfreq: -11.3760 -0.0005 -0.0003 -0.0003 4.6776 17.9961 41.9673 70.2956 86.7133
frequency: 41.7395 69.6844 86.4729 103.7039 131.3861 180.5477 222.6129 243.8792 251.8326 280.5634 340.8241 360.0426 374.7627 467.3101 506.9144 534.2680 573.9536 588.3394 613.0453 670.0959 718.9991 734.4766 749.6370 764.2072 773.0291 788.5144 799.5388 832.7123 900.7485 907.5350 951.8638 979.8065 980.6086 985.5902 995.1758 1023.8127 1034.9360 1045.4472 1067.1790 1085.8468 1086.6642 1101.1127 1106.4104 1146.2656 1161.5240 1185.4488 1193.3930 1204.1328 1238.7041 1279.4641 1304.8035 1311.0759 1330.4993 1387.4399 1441.7442 1452.4937 1477.6861 1482.2494 1490.6943 1492.7046 1507.8821 1512.4575 1522.9067 1535.7052 1557.9680 1628.0904 1639.7883 1676.8742 2162.1728 3033.4708 3078.5492 3086.6632 3126.6286 3138.1658 3156.6582 3171.0149 3174.9214 3180.4959 3181.2038 3187.9785 3189.8731 3192.2570 3197.4454 3213.5129
redmass: 3.5372 2.9276 3.3944 3.4439 3.2023 3.1895 1.3028 2.1024 1.2391 2.7038 3.8034 3.3450 3.3208 2.6459 3.2512 2.9385 3.3836 2.8353 3.3746 2.1514 1.5072 3.5302 2.6811 3.6762 2.9471 1.8376 2.9593 1.5614 1.3616 2.0768 2.9057 1.4307 1.7094 1.8001 1.2983 1.3866 2.1646 1.8646 2.2410 1.6796 1.4922 1.1657 1.1678 1.7468 1.4747 1.4411 1.5198 2.1605 1.7334 1.7905 1.8635 1.4814 3.4236 1.8469 1.3228 1.1568 1.1457 1.1659 1.2255 1.5632 1.0722 1.2236 1.5325 1.2327 8.1391 5.7383 5.5435 5.9544 1.0789 1.0799 1.0317 1.0352 1.0820 1.0852 1.0988 1.1029 1.1081 1.0968 1.0958 1.0968 1.1018 1.1061 1.0944 1.0983
irintensity: 2.0709 0.2808 1.6421 1.9696 4.3726 23.0916 0.5443 2.7246 6.9749 7.4459 1.9418 2.1574 0.4215 3.6624 8.0750 10.9061 7.0111 4.5760 5.9695 50.4000 0.4610 23.5927 32.7921 26.9755 17.6871 23.9285 38.9534 18.2222 2.7107 10.0319 14.1100 0.7342 2.4929 0.5457 0.2502 2.8029 14.2547 17.7665 7.8152 22.1265 16.7299 20.7426 3.9602 59.6744 30.1485 27.1666 24.1605 4.8333 8.7928 16.9484 18.0590 0.9476 3.6317 4.2676 121.1260 11.2989 5.5991 9.1287 6.1548 3.2208 21.5447 7.1272 57.7641 23.0779 0.4290 2.1534 12.4931 4.1827 506.6890 907.8979 8.8170 27.0242 16.0543 48.8106 116.9438 47.5987 2.0793 8.0761 6.9425 0.8829 0.6933 1.5461 24.8893 19.8924
temp: 298.150 k
press: 1.00000 atm
elementType: 1 6 6 6 1 6 1 6 1 6 1 1 1 6 1 1 1 7 1 1 6 5 6 6 6 1 6 1 1 1
symmnumber: 1
zpe: 674028.9 jmol-1
zpe.correction: 0.256724 hartree
zpe.thermalcorrener: 0.269714 hartree
zpe.thermalcorrenthalpy: 0.270658 hartree
zpe.thermalcorrgfe: 0.217085 hartree
zpe.sumelectzpe: -546.146215 hartree
zpe.sumelectthermal: -546.133226 hartree
zpe.sumelectthermalent: -546.132281 hartree
zpe.sumelectthermalfe: -546.185854 hartree
dipole: 2.2315 -10.4852 0.9448
dipole: 10.7616
quadrupole: -58.3809 -110.0365 -86.6495
quadrupole: -55.9109 4.2003 1.6699
quadrupole: 26.6414 -25.0142 -1.6272 -55.9109 4.2003 1.6699
hfenergy: -546.4029394 hartree
pointgroup: C01 [X(C12H16B1N1)]
dipole: 0.8779501 -4.125203 0.371695 debye
polarizability: 186.5034525|1.5621239|229.3117031|-9.6835943|-13.1837111|148.3510269 unknown
InChI: InChI=1/C12H16BN/c1-14(2)12-8-4-3-7-11(12)13-9-5-6-10-13/h3-10,13-14H,1-2H3
charge 0 multiplicity 1
30 atoms
H  0.44035425 1.01644187 0.27232205
C  1.49411896 0.75960717 0.25078788
C  2.44835399 1.76500377 0.18539814
C  1.87673556 -0.5806753 0.28873593
H  2.13397945 2.80333263 0.1534595
C  3.22486639 -0.90311571 0.26050358
H  1.13231759 -1.36650485 0.33932062
C  4.14650926 0.13393422 0.19618529
H  3.5382235 -1.94165739 0.28455908
C  6.01882212 -0.68800448 -1.18388246
H  5.6751584 0.00870267 -1.9456031
H  7.10580447 -0.7626629 -1.20218391
H  5.57002098 -1.66789001 -1.34255229
C  6.08124408 -1.00245905 1.26774565
H  5.66107096 -2.00380503 1.18964928
H  7.16848317 -1.05259051 1.21909929
H  5.76639738 -0.53731939 2.19985167
N  5.59286318 -0.16922663 0.14158248
H  6.03119942 2.28001912 0.53758403
H  6.00259723 0.78738785 0.25415107
C  3.82394853 1.48775851 0.15420474
B  4.95534066 2.64487873 0.00770549
C  5.23279209 3.05914472 -1.53807828
C  4.57283517 4.08919596 0.60851467
C  5.04850287 4.38770938 -1.66032779
H  5.51272449 2.44539805 -2.39340378
C  4.65941228 5.00480225 -0.37537412
H  4.30212811 4.36246965 1.62624533
H  5.16358936 4.96647313 -2.57487599
H  4.48159288 6.07361954 -0.27289431
