program: Gaussian 16
title: cl_biphenylene_h2
version: AS64L-G16RevC.02
method: RwB97XD
basis: GenECP
operation: Freq
keyword: #N
keyword: Geom=AllCheck
keyword: Guess=TCheck
keyword: SCRF=Check
keyword: GenChk
keyword: RwB97XD/GenECPFreq
converged: YES YES NO YES
title: Mulliken charges:
elementType: C C C C C C C H C H H C H C H C C H B N C H H H C H H H H H Cl Cl
charge: 0.049623 0.250126 0.011736 -0.162198 -0.319463 -0.028726 -0.217848 0.216641 -0.468623 0.250479 0.186367 -0.462683 0.213316 -0.303090 0.239764 0.221007 0.111136 0.177821 -0.809367 0.231256 -0.413265 0.196974 0.233461 0.259217 -0.340092 0.251263 0.227504 0.212714 -0.009396 0.191940 -0.022014 -0.175581
chargesum: -0.00000
title: Mulliken charges with hydrogens summed into heavy atoms:
elementType: C C C C C C C C C C C C B N C C Cl Cl
charge: 0.049623 0.250126 0.011736 -0.162198 -0.102822 -0.028726 0.032632 -0.282257 -0.249367 -0.063327 0.398828 0.111136 -0.617427 0.221861 0.276387 0.351390 -0.022014 -0.175581
1716.lowfreq: -2.9906 -0.0009 0.0014 0.0014 9.6195 12.3692 46.3565 56.8316 88.3236
frequency: 45.6934 56.7896 88.2011 103.3027 119.2145 135.4492 152.3642 165.5519 191.1981 223.2270 239.9101 263.4317 268.3303 300.7881 309.0488 341.1420 361.1437 414.1342 452.6229 464.2404 475.0538 549.5908 557.1408 592.5183 606.8416 632.8712 646.1539 667.2265 693.1592 736.7956 745.3570 778.9783 797.0410 809.4772 828.9635 897.5335 928.2499 945.2326 961.3823 997.4699 1005.3559 1016.1974 1034.4649 1037.7740 1049.4221 1070.9191 1077.1068 1084.1817 1152.1413 1154.3037 1172.5432 1188.4792 1199.3887 1203.8818 1221.7182 1251.3420 1267.2172 1294.2870 1312.8574 1410.7088 1434.1761 1451.4924 1468.2979 1481.1917 1486.6939 1491.6779 1503.9361 1505.8780 1514.6370 1515.6663 1524.5637 1536.0269 1651.9596 1671.6032 1690.7486 1746.7462 2496.9868 3060.5551 3084.3242 3094.0583 3184.8601 3186.7354 3188.5242 3196.7097 3198.1901 3203.2052 3203.2748 3215.7158 3217.7691 3225.4439
redmass: 5.9866 9.8506 3.7956 3.4705 5.2233 6.1395 4.4095 3.7158 13.9624 1.5954 2.4002 1.0862 8.8196 3.4366 3.3143 4.1882 4.7044 5.4180 5.8726 4.3570 3.2115 4.8259 3.7654 4.8392 6.1191 4.5376 5.8857 4.2399 5.7876 3.0237 6.3359 1.6057 1.5784 4.0996 3.8977 3.8996 1.3572 1.3811 3.2500 1.3139 6.0165 1.3205 1.1642 2.0129 2.2272 1.6931 1.6276 1.1948 1.9856 2.8080 1.7357 1.7658 1.8198 2.4138 1.7089 2.0198 1.8033 2.1294 2.5715 2.2966 2.2631 1.1357 1.1648 1.1734 1.1146 1.2771 2.4000 1.0902 1.8239 1.1438 1.7046 2.0109 8.5536 7.0466 7.7791 8.7929 1.0884 1.0732 1.0322 1.0403 1.1085 1.0871 1.1070 1.1074 1.1079 1.0921 1.0885 1.0963 1.0927 1.0971
irintensity: 2.0595 3.7243 1.1561 5.1574 1.7518 22.6651 1.0292 1.1194 14.9514 0.6717 0.4824 1.2933 9.2432 1.1238 0.2815 1.2931 6.4906 3.8587 39.2421 1.3400 7.4046 53.7613 18.7449 39.2552 3.4948 8.1976 16.7550 4.9073 150.0149 38.1438 1.8013 10.9813 68.5060 15.3007 5.8724 8.7988 4.5880 1.9381 28.7086 0.4277 19.4936 8.4625 105.6154 13.3426 13.0046 44.9359 155.8972 6.1421 53.0946 41.0823 23.7671 2.4100 1.2650 10.6265 7.3548 12.0000 5.2942 11.1807 18.1531 2.4987 50.6719 3.9068 4.3144 2.3757 5.0247 7.4508 4.2805 17.5679 13.4748 23.4428 41.4438 16.8113 4.8064 4.0520 5.1497 9.5013 177.8556 926.6356 22.1229 127.2213 0.5432 2.9498 1.9152 0.4297 1.5407 14.3871 0.6917 20.5209 11.0575 8.1646
temp: 298.150 k
press: 1.00000 atm
elementType: 6 6 6 6 6 6 6 1 6 1 1 6 1 6 1 6 6 1 5 7 6 1 1 1 6 1 1 1 1 1 17 17
symmnumber: 1
zpe: 664996.7 jmol-1
zpe.correction: 0.253284 hartree
zpe.thermalcorrener: 0.269469 hartree
zpe.thermalcorrenthalpy: 0.270413 hartree
zpe.thermalcorrgfe: 0.209476 hartree
zpe.sumelectzpe: -1541.650213 hartree
zpe.sumelectthermal: -1541.634028 hartree
zpe.sumelectthermalent: -1541.633084 hartree
zpe.sumelectthermalfe: -1541.694021 hartree
dipole: -13.3553 -2.8339 -0.6398
dipole: 13.6677
quadrupole: -128.4993 -94.7601 -125.3675
quadrupole: 19.5531 -0.0838 2.4388
quadrupole: -12.2904 21.4489 -9.1585 19.5531 -0.0838 2.4388
hfenergy: -1541.9034967 hartree
pointgroup: C01 [X(C14H14B1Cl2N1)]
dipole: -5.2543877 -1.1149333 -0.2517314 debye
polarizability: 323.8441947|24.5814874|274.1615775|-14.852248|-4.2850563|149.7879511 unknown
InChI: InChI=1/C14H14BCl2N/c1-18(2)12-8-4-6-10-9-5-3-7-11(15(16)17)13(9)14(10)12/h3-8,15,18H,1-2H3
charge 0 multiplicity 1
32 atoms
C  0.13314804 1.09348509 -0.09653328
C  -0.47365022 2.36339341 -0.00894586
C  -1.83488997 1.71651457 0.08709201
C  -1.21586291 0.44174296 0.01561258
C  -3.18648299 1.86523946 0.19267428
C  -1.95247698 -0.69912531 0.07040723
C  -3.94610991 0.66657793 0.22859284
H  -3.67573795 2.82966659 0.24787613
C  -3.35858973 -0.57971743 0.17045679
H  -5.02499486 0.72837379 0.30886255
H  -3.98604303 -1.46187754 0.2081209
C  0.26310988 3.51607609 -0.04515275
H  -0.16502306 4.50899974 0.0193728
C  1.65607296 3.3234856 -0.17769401
H  2.30289763 4.19366278 -0.2108363
C  2.23049303 2.06251657 -0.27345169
C  1.47973886 0.85885609 -0.23914274
H  3.30735417 1.99176236 -0.38275195
B  2.05601085 -0.62534437 -0.41875208
N  -1.283581 -2.00581578 -0.00317715
C  -1.818799 -3.01853756 0.94810341
H  -2.80637404 -3.34199143 0.62546745
H  -1.13469228 -3.86555413 0.95393571
H  -1.86617695 -2.57063613 1.93847075
C  -1.22189852 -2.52579188 -1.40019452
H  -0.6298295 -3.4398823 -1.40189602
H  -2.2362176 -2.72126359 -1.7465857
H  -0.7440967 -1.77266025 -2.02254883
H  -0.30018491 -1.843974 0.31197691
H  1.52805888 -1.22367607 -1.3242758
Cl 1.5651693 -1.66236529 1.18889551
Cl 3.9100515 -0.70369697 -0.61611516
