program: Gaussian 16
title: cl_dibenzofuran_h2
version: AS64L-G16RevC.02
method: RwB97XD
basis: GenECP
operation: Freq
keyword: #N
keyword: Geom=AllCheck
keyword: Guess=TCheck
keyword: SCRF=Check
keyword: GenChk
keyword: RwB97XD/GenECP
keyword: Freq
converged: YES YES YES YES
title: Mulliken charges:
elementType: C C O C C C C C H C H H C H C H C C H B N C H H H C H H H H H Cl Cl
charge: -0.721911 1.143593 0.030116 1.003568 -0.874055 -0.442683 -0.214265 -0.355008 0.203524 -0.298396 0.257081 0.209160 -0.363316 0.188278 -0.577703 0.236211 0.146576 0.144656 0.174461 -0.499968 -0.024194 -0.415167 0.236389 0.223314 0.239133 -0.353298 0.227162 0.224830 0.248732 0.455464 0.031181 -0.200313 -0.283149
chargesum: -0.00000
title: Mulliken charges with hydrogens summed into heavy atoms:
elementType: C C O C C C C C C C C C C B N C C Cl Cl
charge: -0.721911 1.143593 0.030116 1.003568 -0.874055 -0.239158 -0.214265 -0.097927 -0.089236 -0.175039 -0.341492 0.321036 0.144656 -0.468787 0.431270 0.283669 0.347425 -0.200313 -0.283149
1716.lowfreq: -10.1586 0.0010 0.0015 0.0019 3.0607 11.2354 30.3231 48.7473 65.7205
frequency: 29.5481 48.6770 65.6429 78.1160 98.8279 121.8520 144.7442 167.5027 188.8582 227.6368 242.0825 252.5388 271.9433 286.6192 287.5859 297.1751 326.5152 374.3665 429.5274 469.5624 494.3888 559.0948 563.4192 579.9190 587.1953 606.9549 609.3852 638.3863 652.7555 667.2989 703.4759 759.2097 775.0020 788.3167 801.6974 819.2618 861.0374 886.0041 910.4577 932.8256 947.5994 980.6713 1001.3803 1011.7720 1026.1368 1029.3492 1062.1603 1076.6226 1088.0811 1088.9485 1148.8605 1176.8491 1182.1171 1189.6931 1197.8868 1210.1431 1256.1471 1274.6593 1277.4297 1312.6121 1336.7266 1353.8933 1390.3530 1436.7495 1447.0418 1456.3260 1463.5759 1483.4819 1489.8011 1498.1639 1503.9281 1505.3319 1516.4665 1537.3890 1549.6302 1654.1937 1668.8772 1670.8331 1722.2796 2504.5897 3090.6639 3091.0163 3189.5516 3193.5283 3195.4120 3200.8597 3203.6882 3204.3049 3204.9343 3212.7509 3213.4656 3225.6752 3428.1473
redmass: 14.7194 5.5071 7.0895 4.2713 2.9886 5.9871 3.9390 4.1273 14.0962 2.6002 1.2231 1.4112 8.0920 4.0647 4.1806 3.0109 6.4393 4.1978 3.8294 3.8576 5.6575 4.1588 4.7830 3.9523 6.0755 5.7002 6.5326 4.7021 4.2614 5.6818 7.0548 2.0867 3.0891 2.8936 2.0163 2.4105 5.5997 5.7626 4.1489 1.3808 1.3649 3.0659 1.3214 1.3152 2.1763 1.1313 1.6601 1.1651 1.9413 1.8158 2.9437 1.4881 1.4103 1.8946 1.5435 2.3940 2.3774 1.6592 2.2749 2.1901 2.8292 6.5981 3.5753 2.7418 1.1609 1.1864 1.5194 1.1843 1.0422 1.0566 1.0602 1.9784 1.2370 3.0009 3.1392 7.0660 8.0883 7.2482 8.1364 1.0889 1.0309 1.0313 1.0869 1.1086 1.1085 1.1061 1.0913 1.0971 1.1025 1.0928 1.0972 1.0976 1.0778
irintensity: 3.3220 4.2333 12.5531 2.5250 4.6510 2.7113 2.4100 1.3149 5.3253 0.3344 0.2292 0.5157 5.8435 0.5378 2.7283 4.0645 1.9342 5.1969 0.9258 7.7628 40.1379 8.4787 19.0095 0.9439 4.9761 78.0719 50.2380 35.8169 2.1050 124.6748 4.0973 23.3859 34.8517 41.2472 50.7547 2.3003 20.4102 18.8694 2.0336 1.1688 3.3252 28.3818 0.1210 6.6332 17.1485 108.7943 146.4213 2.8548 10.3672 80.3227 60.1721 43.7240 19.6559 1.9648 23.3708 71.1552 32.8329 9.4142 27.7873 44.8674 51.9792 1.7039 1.7078 68.0106 3.2401 11.9487 91.8516 18.9801 1.8565 24.4478 19.1819 24.4230 52.2496 84.7235 19.6860 41.8464 17.7354 0.6518 32.1960 216.3519 1.4390 6.1403 4.1557 0.1185 5.8133 1.4431 3.6099 0.8573 0.5926 2.2642 27.6229 6.7047 118.7853
temp: 298.150 k
press: 1.00000 atm
elementType: 6 6 8 6 6 6 6 6 1 6 1 1 6 1 6 1 6 6 1 5 7 6 1 1 1 6 1 1 1 1 1 17 17
symmnumber: 1
zpe: 681800.6 jmol-1
zpe.correction: 0.259684 hartree
zpe.thermalcorrener: 0.276560 hartree
zpe.thermalcorrenthalpy: 0.277504 hartree
zpe.thermalcorrgfe: 0.214086 hartree
zpe.sumelectzpe: -1616.916964 hartree
zpe.sumelectthermal: -1616.900088 hartree
zpe.sumelectthermalent: -1616.899143 hartree
zpe.sumelectthermalfe: -1616.962562 hartree
dipole: 22.0591 -6.8126 1.7141
dipole: 23.1506
quadrupole: -154.6014 -88.6803 -130.6974
quadrupole: -22.8165 -0.2095 -5.4883
quadrupole: -29.9417 35.9794 -6.0377 -22.8165 -0.2095 -5.4883
hfenergy: -1617.1766477 hartree
pointgroup: C01 [X(C14H14B1Cl2N1O1)]
dipole: 8.6787021 -2.6802975 0.674397 debye
polarizability: 318.8289764|-25.9319294|276.7961577|-1.5815467|3.462308|153.285737 unknown
InChI: InChI=1/C14H14BCl2NO/c1-18(2)12-8-4-6-10-9-5-3-7-11(15(16)17)13(9)19-14(10)12/h3-8,15,18H,1-2H3
charge 0 multiplicity 1
33 atoms
C  -0.66718655 1.03794678 0.20160435
C  0.28258676 2.06136742 0.14003571
O  -0.04224281 -0.20339332 0.26022597
C  1.58032772 1.40792635 0.15261958
C  1.27543013 0.04588842 0.21644915
C  2.91975675 1.78189187 0.10247681
C  2.24129824 -0.93517947 0.20999467
C  3.90052204 0.79205059 0.11067532
H  3.20229516 2.82658973 0.05313251
C  3.57570037 -0.56584318 0.15802399
H  4.94479618 1.07560844 0.07197478
H  4.36207808 -1.31123911 0.14911559
C  -0.16062612 3.38220392 0.06911999
H  0.53904783 4.20831968 0.0195943
C  -1.52973898 3.59477877 0.06077671
H  -1.91131522 4.60818972 0.00446843
C  -2.43910868 2.52780794 0.12216649
C  -2.04532645 1.19017732 0.19482826
H  -3.50129637 2.74658128 0.11452948
B  -3.00603016 -0.0996077 0.29386527
N  1.76947057 -2.32801346 0.22014758
C  2.0385902 -3.02122161 -1.07945326
H  3.11600992 -3.10443111 -1.2088248
H  1.57943641 -4.00751376 -1.04646118
H  1.6046078 -2.42467313 -1.87875519
C  2.27160461 -3.1062209 1.39327893
H  1.80409714 -4.08911894 1.38034876
H  3.35228696 -3.20160732 1.31038334
H  2.00734187 -2.56782053 2.30082155
H  0.74959708 -2.26415482 0.31351342
H  -2.71991112 -0.81697296 1.21893177
Cl -4.82392808 0.39308766 0.46243757
Cl -2.79493227 -1.15350759 -1.30957484
