program: Gaussian 16
title: cl_indole_h2
version: AS64L-G16RevC.02
method: RwB97XD
basis: GenECP
operation: Freq
keyword: #N
keyword: Geom=AllCheck
keyword: Guess=TCheck
keyword: SCRF=Check
keyword: GenChk
keyword: RwB97XD/GenECPFreq
converged: YES YES NO NO
title: Mulliken charges:
elementType: C C C C C C C C H H H N H B C H H H C H H H H H Cl Cl
charge: -0.313385 0.613383 -0.755424 -0.774298 0.565344 -0.512387 -0.282155 0.561067 0.196930 0.229422 0.232014 0.120621 0.270221 -0.660338 -0.433395 0.262940 0.261586 0.163120 -0.547604 0.210698 0.170205 0.173913 0.434625 0.082968 -0.134843 -0.135229
chargesum: 0.00000
title: Mulliken charges with hydrogens summed into heavy atoms:
elementType: C C C C C C C C N B C C Cl Cl
charge: -0.313385 0.883604 -0.755424 -0.577367 0.565344 -0.282965 -0.050141 0.561067 0.555246 -0.577370 0.254251 0.007213 -0.134843 -0.135229
1716.lowfreq: -25.2447 -21.5425 -6.0032 0.0028 0.0035 0.0037 6.2822 38.2210 43.7942
frequency: -21.3603 34.4487 43.2789 94.1107 115.5915 135.0623 179.2909 215.4637 224.7682 255.6736 278.8218 325.0368 329.8750 373.4222 428.4770 463.7080 517.1883 569.0900 597.2191 614.6519 632.9923 679.6763 698.5200 747.0951 769.2157 812.7520 845.3796 852.1899 893.1030 917.6916 944.5811 1000.7793 1005.0532 1024.5025 1032.0149 1052.4278 1067.4658 1121.7433 1135.7750 1150.3311 1168.4778 1189.3379 1211.5815 1252.3981 1282.2220 1300.5777 1324.7057 1368.1241 1385.3441 1421.1569 1458.6765 1469.6579 1485.3895 1488.6885 1500.3323 1505.2823 1550.3604 1656.0097 1699.5631 1708.6149 2483.6012 3049.8146 3092.8831 3118.4151 3140.7132 3190.8947 3194.9210 3198.9656 3208.0811 3217.3749 3255.9862 3469.3622
redmass: 1.0311 5.2110 5.8669 4.8314 4.9244 4.4193 9.5041 3.5495 1.6354 2.6927 3.6845 3.7518 3.6072 3.5648 3.1049 4.4553 3.7803 5.2772 3.5870 5.7826 4.7969 4.3628 5.3592 4.6238 3.9867 3.7206 3.5056 1.3543 1.3551 1.4488 3.5996 1.3611 1.8111 1.4716 1.1383 2.7473 1.5613 1.9466 2.2127 1.4798 1.3499 1.3764 1.4639 1.9614 1.7713 4.3906 1.5327 3.3184 1.3996 1.2593 1.4755 1.3587 1.0540 1.0629 1.0746 1.4095 3.2275 7.6563 7.6124 7.6594 1.0881 1.0380 1.0309 1.0995 1.1032 1.0900 1.0980 1.1036 1.1087 1.0953 1.0973 1.0750
irintensity: 0.2791 4.2577 0.1498 2.2516 3.3660 2.1008 10.1078 2.7412 2.7979 3.6103 6.6827 8.2646 3.1652 2.9758 6.9199 21.6847 21.8120 7.8568 12.5816 49.4507 16.6590 85.4587 110.8635 1.8080 6.0191 36.3036 3.4902 24.3720 8.1805 25.8028 6.8061 3.8264 23.5705 9.1539 140.8920 3.0866 14.1189 121.2910 72.0217 27.7442 5.9459 10.3405 13.2419 19.6643 14.5932 4.0364 8.7639 2.4692 15.2528 0.5000 1.0398 6.5607 11.8694 11.7724 23.2506 35.3384 44.6032 1.4303 8.0569 1.3996 216.1848 28.3529 8.7718 13.4926 14.7438 10.8789 0.4270 6.3755 0.3977 5.7269 1.3622 83.9569
temp: 298.150 k
press: 1.00000 atm
elementType: 6 6 6 6 6 6 6 6 1 1 1 7 1 5 6 1 1 1 6 1 1 1 1 1 17 17
symmnumber: 1
zpe: 539671.2 jmol-1
zpe.correction: 0.205550 hartree
zpe.thermalcorrener: 0.218492 hartree
zpe.thermalcorrenthalpy: 0.219436 hartree
zpe.thermalcorrgfe: 0.164626 hartree
zpe.sumelectzpe: -1388.134905 hartree
zpe.sumelectthermal: -1388.121963 hartree
zpe.sumelectthermalent: -1388.121019 hartree
zpe.sumelectthermalfe: -1388.175829 hartree
dipole: 13.6251 3.5323 2.4791
dipole: 14.2921
quadrupole: -119.6287 -90.2893 -99.7601
quadrupole: -3.5128 -3.7183 8.9947
quadrupole: -16.4026 12.9367 3.4659 -3.5128 -3.7183 8.9947
hfenergy: -1388.3404553 hartree
pointgroup: C01 [X(C10H12B1Cl2N1)]
dipole: 5.3605098 1.3897072 0.9753514 debye
dipolederiv: -0.1441024 0.188046 0.0177542 0.1596851 0.1202786 0.1941619 0.1564672 0.264604 -0.1849196 -0.1204454 0.1542235 0.0708122 0.2042932 0.0003013 0.0728573 0.1056421 0.032408 -0.0575107 0.2557908 -0.0405145 0.0454727 -0.3386041 0.0748145 0.0619565 -0.2004846 0.1035084 -0.0272534 -0.2113764 -0.1068612 -0.0739625 0.1259695 0.0095882 0.0662657 0.0520924 0.0428669 -0.0662056 0.3436131 0.178511 0.1202379 0.1417954 -0.0587513 0.0295561 0.1722977 0.0434759 -0.0601354 -0.0229349 -0.059321 -0.0363929 -0.2668949 -0.0103117 0.0514394 -0.1440383 0.0539498 -0.1142682 -0.093075 -0.0528086 -0.0300307 0.0087326 0.1029282 0.1210279 0.0081947 0.1162876 -0.0654908 0.3844624 -0.0552612 -0.0226809 0.0263591 -0.1698947 -0.0932363 0.009552 -0.1055303 0.0090469 0.1037348 0.003227 0.0076791 -0.0129402 -0.0143333 -0.0858808 0.0078942 -0.0744835 0.112327 -0.0637842 0.0798854 0.0377446 0.0638136 0.0725538 -0.0352879 0.036257 -0.0368261 0.1288533 0.0837311 -0.0245659 -0.013397 -0.0074176 -0.007992 -0.0811284 -0.0001534 -0.0846575 0.1136749 -0.5018304 -0.1071852 -0.0150851 0.1295048 -0.5033871 -0.1039899 0.0610751 -0.0929198 -0.0404042 0.0697265 -0.027238 -0.0251508 -0.0448173 0.062538 -0.0381869 -0.0241375 -0.038657 0.1348746 1.3946365 0.0882077 0.0798116 0.1898656 1.3452605 -0.4643365 0.2152307 -0.4657378 0.9856466 0.0905388 -0.0481958 0.0143101 -0.1575411 0.5009457 -0.0553972 0.1007013 -0.2030961 0.1340662 0.1200015 0.0123523 0.0233238 0.0142675 0.0523237 -0.0660439 0.0165913 0.0033695 0.0146416 0.0426801 0.0668844 0.0346841 0.0462467 0.0818534 0.0299551 0.0457646 0.0323905 0.0909578 0.015727 -0.1054207 -0.0692118 -0.0199049 0.0064504 -0.0012757 -0.0818761 -0.0193857 0.0589722 -0.0738582 -0.0516652 -0.0365034 0.0660394 0.1208488 0.0069887 -0.1222292 -0.0341078 0.0813822 -0.0552683 -0.0257408 -0.0610603 -0.0281622 0.040159 0.075497 -0.1101109 0.0550891 -0.0373288 -0.0595788 -0.020894 0.0420184 -0.0170118 0.0641024 -0.0600754 0.1231712 -0.0270822 -0.0237874 0.0200382 0.0565119 0.0033867 -0.0622162 -0.1240967 -0.0492412 -0.0011237 -0.0302145 0.085638 0.2189909 0.0052455 -0.0037507 0.0225213 0.1532598 0.0186624 -0.0608403 0.0358963 0.281588 -0.2980445 -0.0109286 -0.0155735 -0.007234 -0.3064018 -0.0983271 -0.0285158 -0.1021013 -0.3755858 -0.722869 -0.3019996 0.099678 -0.4447423 -0.9427929 0.2107729 0.0302826 0.0917083 -0.3831404 -0.7765041 0.2055058 -0.1941138 0.2083927 -0.6702448 0.2932664 -0.3677043 0.4392451 -0.7956391 unknown
polarizability: 253.6221055|-3.4015895|179.5902116|6.1603631|14.3578707|132.5412267 unknown
InChI: InChI=1/C10H12BCl2N/c1-7-3-4-8-6-10(11(12)13)14(2)9(8)5-7/h3-6,11,14H,1-2H3
charge 0 multiplicity 1
26 atoms
C  -1.00138955 -0.23683356 -0.04286387
C  -0.26204862 -1.23458526 -0.53526933
C  1.29702894 0.2761432 0.22815871
C  2.50345315 0.8662225 0.53232364
C  3.66609043 0.16913682 0.19046539
C  3.54907592 -1.07439701 -0.44250345
C  2.31789183 -1.6480054 -0.73873209
C  1.16407962 -0.95424544 -0.394926
H  2.56384016 1.83272634 1.0205312
H  4.4554107 -1.60688512 -0.71149581
H  2.26107326 -2.61223719 -1.22924488
N  -0.04606649 0.81125714 0.47626907
H  -0.68423027 -2.13494363 -0.95755378
B  -2.56828353 0.02999338 0.16461913
C  -0.2678575 2.16831732 -0.11465858
H  -0.14202891 2.08383917 -1.19166598
H  -1.28160089 2.48394428 0.11800083
H  0.4609273 2.85579286 0.31079689
C  5.02252143 0.73430824 0.51855886
H  5.42847554 0.26226307 1.41824488
H  5.72944991 0.55612656 -0.29431556
H  4.97358467 1.80953326 0.69913412
H  -0.21274483 0.87537515 1.48381577
H  -2.75967256 0.70620562 1.14759871
Cl -3.45725111 -1.61384198 0.33822378
Cl -3.2455246 0.98072269 -1.34033266
