program: Gaussian 16
title: MeQHBCl2-H2
version: ES64L-G16RevC.01
method: RwB97XD
basis: GenECP
operation: Freq
keyword: #N
keyword: Geom=AllCheck
keyword: Guess=TCheck
keyword: SCRF=Check
keyword: GenChk
keyword: RwB97XD/GenECP
keyword: Freq
converged: YES YES YES YES
title: Mulliken charges:
elementType: C C H C N N N B H H H H H Cl Cl
charge: -0.407593 -0.469797 0.271917 0.092738 0.260077 -0.012890 -0.185983 -0.393126 0.377951 0.225815 0.220679 0.221823 0.144742 -0.162357 -0.183998
chargesum: -0.00000
title: Mulliken charges with hydrogens summed into heavy atoms:
elementType: C C C N N N B Cl Cl
charge: 0.260724 -0.197880 0.092738 0.260077 -0.012890 0.191969 -0.248384 -0.162357 -0.183998
1716.lowfreq: 0.0013 0.0035 0.0036 10.1253 17.8542 24.3780 36.5428 80.9392 101.0717
frequency: 36.1389 80.5886 100.7704 131.9392 198.0651 255.5437 283.8241 346.7481 421.7483 580.2040 654.0047 680.2197 689.8118 717.0559 759.3391 816.2286 860.4147 1027.8539 1035.1252 1084.3402 1090.5798 1097.7233 1162.5630 1185.5772 1252.6541 1336.7314 1417.5260 1454.2129 1461.5373 1487.9907 1494.1042 1522.3262 1625.4194 2551.5881 3092.4397 3184.7552 3206.3332 3309.8701 3606.9882
redmass: 5.4982 1.1302 5.0209 5.6833 9.6989 5.3720 6.5423 7.3590 3.3845 5.6735 5.1760 5.8423 5.2670 4.4906 4.0580 1.1658 1.4228 1.3068 1.3477 1.8316 3.5214 2.2520 1.3388 1.6774 1.9358 7.2370 3.4482 1.8457 1.7600 1.0498 2.4773 1.4773 3.9187 1.0888 1.0320 1.1074 1.1070 1.1026 1.0846
irintensity: 0.2085 0.0895 1.1472 1.6914 7.4446 2.4328 4.5863 15.1098 24.4136 4.6213 58.0918 150.2704 26.5797 29.2307 25.0365 75.7909 30.7703 93.0298 102.7227 15.5138 48.1101 45.5110 0.0185 99.4178 85.7363 1.1101 11.8670 6.6345 11.0260 20.1840 24.8332 8.3115 26.3060 163.6817 8.2420 1.0712 0.0006 11.3636 214.5002
temp: 298.150 k
press: 1.00000 atm
elementType: 6 6 1 6 7 7 7 5 1 1 1 1 1 17 17
symmnumber: 1
zpe: 282922.1 jmol-1
zpe.correction: 0.107759 hartree
zpe.thermalcorrener: 0.116888 hartree
zpe.thermalcorrenthalpy: 0.117833 hartree
zpe.thermalcorrgfe: 0.071387 hartree
zpe.sumelectzpe: -1227.384242 hartree
zpe.sumelectthermal: -1227.375113 hartree
zpe.sumelectthermalent: -1227.374169 hartree
zpe.sumelectthermalfe: -1227.420615 hartree
dipole: 9.3640 7.7156 -2.7514
dipole: 12.4413
quadrupole: -91.1205 -97.8135 -72.3419
quadrupole: -25.1065 12.1554 12.9048
quadrupole: -4.0285 -10.7215 14.7500 -25.1065 12.1554 12.9048
hfenergy: -1227.4920017 hartree
pointgroup: C01 [X(C3H6B1Cl2N3)]
dipole: 3.6840952 3.0355551 -1.0824727 debye
dipolederiv: 0.5237958 0.1785818 0.0096546 0.1735091 0.2735758 0.0230072 0.0126172 0.0241826 0.1222957 -0.1378524 -0.1197398 0.3433993 -0.0343459 -0.1100105 0.1504946 -0.0577276 -0.0412959 0.0021917 0.1294473 -0.0277885 -0.0172477 -0.0224019 0.1853514 0.0075892 -0.0139379 0.0043306 0.1336996 0.1041831 0.1445173 -0.326883 0.0535831 0.0026952 -0.0959388 0.0357895 0.1022694 -0.259508 -0.3323669 -0.1379991 -0.105841 -0.0971845 -0.0792441 -0.1287068 -0.2528593 -0.2049722 0.3443047 0.0720902 -0.0302051 0.3177097 -0.0143396 -0.1342718 0.2417893 0.3798602 0.3183339 -0.544292 -0.4015461 -0.1152489 -0.285743 -0.1173537 -0.1248678 -0.1686161 -0.2220428 -0.1811221 0.1839594 1.0597778 0.0326305 0.4832178 0.1745511 1.0871196 -0.2943776 0.5069881 -0.2233973 1.2824178 0.4140462 0.0716697 0.0358731 0.0618277 0.3375582 -0.0059831 0.0698019 0.0172307 0.3499696 -0.0054359 -0.0301472 -0.012254 0.0366462 -0.0010166 0.0436308 -0.0367023 0.0333021 0.1035843 0.0636474 -0.023147 -0.0467638 -0.0376064 0.1062789 -0.0000779 0.0307197 0.039227 0.0112728 0.0091085 0.0056982 0.0477592 -0.0440743 0.0281849 -0.0541244 0.006798 -0.077386 0.0600192 -0.2735789 0.0449904 0.0357123 0.0163131 -0.3303509 -0.0424972 0.046502 -0.0566359 -0.2662957 -0.4937494 0.1415179 -0.1931657 0.0815117 -0.7770268 0.4433908 -0.1061119 0.3280812 -0.7134411 -0.7315667 -0.1353301 -0.2854278 -0.2306355 -0.4639753 -0.1195799 -0.3996948 -0.0821481 -0.8101781 unknown
polarizability: 115.2711727|20.2382997|93.7854931|3.8124975|-11.0400718|110.1961807 unknown
InChI: InChI=1/C3H6BCl2N3/c1-9-2-3(4(5)6)7-8-9/h2,4,7H,1H3
charge 0 multiplicity 1
15 atoms
C  1.52591605 0.18310217 0.04434278
C  -0.45390089 -1.02202033 1.04710288
H  -0.06085519 -1.03668382 2.04894359
C  -1.62965971 -1.51930034 0.52953036
N  0.22126466 -0.46803638 0.01163003
N  -0.42519209 -0.57186215 -1.11704237
N  -1.52470997 -1.19966273 -0.7816453
B  -2.89700002 -2.26239519 1.190099
H  -2.20847221 -1.43071687 -1.49458092
H  2.27091479 -0.53180606 0.38963862
H  1.7585703 0.51086715 -0.96533139
H  1.48022062 1.03784729 0.71717009
H  -3.54421109 -1.50512753 1.85850463
Cl -2.25761352 -3.66775033 2.26109912
Cl -3.97406945 -2.90724927 -0.22898978
