program: Gaussian 16
title: cl_naphthalene_h2
version: AS64L-G16RevC.02
method: RwB97XD
basis: GenECP
operation: Freq
keyword: #N
keyword: Geom=AllCheck
keyword: Guess=TCheck
keyword: SCRF=Check
keyword: GenChk
keyword: RwB97XD/GenECPFreq
converged: YES YES YES YES
title: Mulliken charges:
elementType: C C C C C C H C C H H C C H H H B N C H H H C H H H H H Cl Cl
charge: -0.484023 -0.090812 -0.233706 -0.113674 -0.029583 -0.478335 0.185110 0.507953 -0.049585 0.194677 0.247129 -0.586071 0.210106 0.203695 0.240690 0.162240 -0.918858 0.297634 -0.263206 0.203485 0.250169 0.232940 -0.395788 0.241854 0.192283 0.247306 0.169426 0.117288 -0.064275 -0.196071
chargesum: -0.00000
title: Mulliken charges with hydrogens summed into heavy atoms:
elementType: C C C C C C C C C C B N C C Cl Cl
charge: -0.298913 -0.090812 -0.233706 -0.113674 0.165094 -0.231205 0.507953 0.154110 -0.345380 0.372346 -0.801570 0.467060 0.423388 0.285656 -0.064275 -0.196071
chargesum: 0.00000
1716.lowfreq: -9.9740 0.0007 0.0014 0.0016 6.1641 11.0129 20.5090 62.2672 102.0270
frequency: 15.5322 62.1689 102.0103 109.4689 158.8766 161.7075 185.2967 191.8299 210.5264 229.4330 268.3930 276.7510 284.6159 311.2178 360.3259 433.8112 473.3894 484.8724 490.5225 514.4947 543.3648 552.7496 580.6751 642.6422 669.2756 686.1856 722.1022 782.8283 795.8501 800.6417 806.4902 854.7238 904.3283 933.9397 961.9543 982.0442 1010.2833 1023.5420 1030.9260 1035.4286 1049.7663 1059.5199 1120.9208 1127.5684 1170.1899 1182.6474 1186.7101 1195.1166 1210.5498 1234.8371 1259.5436 1272.4745 1286.5332 1361.0168 1365.7127 1383.8647 1410.0697 1454.4737 1464.8915 1483.3009 1485.0933 1492.3921 1501.5111 1503.1013 1511.3198 1524.5498 1570.7448 1649.5955 1671.2084 1702.7226 2514.4241 3086.8331 3091.7824 3184.8573 3187.9557 3190.8885 3193.9695 3199.6607 3202.2440 3204.4915 3206.2870 3216.9376 3223.5477 3302.5894
redmass: 4.8892 8.2535 3.0979 5.3520 5.3318 5.2238 3.0691 7.0048 3.0707 1.2999 2.3456 5.0336 1.6771 3.5847 3.6413 3.3518 4.4859 3.5434 4.3039 6.0991 5.2173 5.0329 4.4445 4.1923 3.3361 3.7577 6.8434 1.4591 2.8958 2.1367 4.5880 2.7123 3.7237 1.4235 1.3807 2.6587 1.3437 1.4185 1.8975 2.0858 1.2184 1.8801 2.6088 1.8477 1.2551 1.3130 1.4463 1.7586 1.3438 1.6894 1.8153 1.9596 2.1188 1.5540 2.1971 2.7664 3.0453 1.1495 1.6589 1.1261 1.0782 1.0446 2.0362 1.3991 1.0629 1.3391 3.4720 6.8330 5.1352 5.7487 1.0861 1.0318 1.0315 1.1074 1.0869 1.1064 1.0893 1.1012 1.1070 1.0940 1.0991 1.0949 1.0981 1.0778
irintensity: 4.7867 2.0404 1.4127 1.9821 17.3347 7.0562 4.2156 6.2949 5.5639 0.7808 5.4448 3.7940 0.9975 2.3296 3.2637 5.4593 37.6329 4.1579 5.1776 55.2759 21.1457 34.7494 8.6700 8.6943 6.4111 22.1037 119.8329 10.7314 12.6155 72.3771 7.8429 31.3228 12.3152 2.8479 3.9132 24.7484 0.5011 9.9907 25.5502 13.3420 6.9656 105.9875 43.5652 12.8522 97.5338 46.0639 13.8153 6.0370 8.3389 10.5850 1.8348 17.8711 1.0207 35.6418 27.6013 15.2828 14.2830 8.4159 5.9308 4.0901 2.4320 16.3635 11.9707 22.7302 20.1530 36.9627 13.9371 0.9341 4.9040 0.9894 194.9559 10.3903 11.8840 10.1372 2.3669 9.0421 3.4671 5.7767 1.2851 16.4575 13.0363 15.0833 15.4040 695.7890
temp: 298.150 k
press: 1.00000 atm
elementType: 6 6 6 6 6 6 1 6 6 1 1 6 6 1 1 1 5 7 6 1 1 1 6 1 1 1 1 1 17 17
symmnumber: 1
zpe: 637272.5 jmol-1
zpe.correction: 0.242724 hartree
zpe.thermalcorrener: 0.257574 hartree
zpe.thermalcorrenthalpy: 0.258518 hartree
zpe.thermalcorrgfe: 0.199837 hartree
zpe.sumelectzpe: -1465.519620 hartree
zpe.sumelectthermal: -1465.504771 hartree
zpe.sumelectthermalent: -1465.503827 hartree
zpe.sumelectthermalfe: -1465.562507 hartree
dipole: 11.0451 -5.6482 0.4369
dipole: 12.4132
quadrupole: -124.3749 -84.1976 -114.3110
quadrupole: -4.2950 -5.7186 9.1737
quadrupole: -16.7470 23.4302 -6.6832 -4.2950 -5.7186 9.1737
hfenergy: -1465.7623446 hartree
pointgroup: C01 [X(C12H14B1Cl2N1)]
dipole: 4.3454784 -2.2221839 0.1718744 debye
polarizability: 262.1274996|-14.4462668|249.7237042|11.040821|12.9187783|145.8715149 unknown
InChI: InChI=1/C12H14BCl2N/c1-16(2)11-8-4-6-9-5-3-7-10(12(9)11)13(14)15/h3-8,13,16H,1-2H3
charge 0 multiplicity 1
30 atoms
C  2.63290763 -1.02537053 -0.26386915
C  1.2917025 -0.75522067 -0.31589347
C  0.74656779 0.55982344 -0.16313672
C  1.71777262 1.5632945 0.16441584
C  3.09996363 1.26018623 0.21891941
C  3.56124559 -0.00285969 -0.01383607
H  2.99337785 -2.03881693 -0.39731624
C  -0.64103723 0.94170514 -0.30897548
C  1.30286964 2.88940374 0.4408372
H  3.79198459 2.06224647 0.45224201
H  4.6194468 -0.22995323 0.01835142
C  -0.01736346 3.21799699 0.38314885
C  -0.96107667 2.24828077 -0.00822071
H  2.05571508 3.62692723 0.69736039
H  -0.34617374 4.22690886 0.60555802
H  -1.99391253 2.55877047 -0.10808035
B  -1.82335871 -0.01037369 -0.87744836
N  0.40992542 -1.93060164 -0.48845376
C  0.53134628 -2.55857427 -1.83424461
H  1.5120852 -3.02201337 -1.92390618
H  -0.25386835 -3.30682962 -1.93529451
H  0.40794871 -1.78318583 -2.58617576
C  0.55248065 -2.92783456 0.61263859
H  -0.23145712 -3.6740455 0.49275523
H  1.53240388 -3.39640988 0.55973668
H  0.42727163 -2.4072262 1.55928442
H  -0.56352169 -1.60427157 -0.4031642
H  -1.47124413 -0.75422844 -1.75874285
Cl -2.43526014 -1.17694379 0.57415756
Cl -3.3103687 0.90946957 -1.53963321
