program: Gaussian 16
title: cl_nmeimidazole_h2
version: AS64L-G16RevC.02
method: RwB97XD
basis: GenECP
operation: Freq
keyword: #N
keyword: Geom=AllCheck
keyword: Guess=TCheck
keyword: SCRF=Check
keyword: GenChk
keyword: RwB97XD/GenECP
keyword: Freq
converged: YES YES NO NO
title: Mulliken charges:
elementType: C C H C N N B H H H H H C H Cl Cl
charge: -0.415089 -0.317514 0.223735 -0.016924 0.033760 -0.146606 -0.363580 0.343428 0.122330 0.224075 0.166937 0.232380 0.026097 0.281350 -0.191390 -0.202987
chargesum: 0.00000
title: Mulliken charges with hydrogens summed into heavy atoms:
elementType: C C C N N B C Cl Cl
charge: 0.208302 -0.093779 -0.016924 0.033760 0.196822 -0.241250 0.307447 -0.191390 -0.202987
chargesum: -0.00000
1716.lowfreq: -19.8467 -0.0024 0.0004 0.0018 8.3025 12.9396 28.7135 75.4065 103.7826
frequency: 22.8420 74.7897 103.7405 122.2175 196.5892 247.2442 274.3601 327.3312 404.4942 565.7832 632.3601 639.7424 675.7432 698.3994 741.5529 744.0458 810.9598 839.2631 999.0687 1030.2924 1060.3450 1064.3160 1104.8244 1157.3311 1172.7249 1184.8826 1258.2559 1373.3203 1429.6866 1464.2160 1466.1136 1487.2758 1518.3635 1604.2704 1656.0180 2537.9721 3083.3390 3171.7442 3185.5206 3301.4760 3308.2706 3630.9349
redmass: 4.7822 1.1119 4.4571 5.7261 9.2252 5.3897 5.5290 8.0701 3.2145 5.6393 2.7501 5.0447 5.6949 3.1226 1.4099 2.5213 1.6004 1.4129 2.4076 1.1652 1.7138 2.7869 1.5456 1.3337 1.2292 1.7052 1.8839 4.5504 2.7608 3.1548 1.2251 1.0371 1.1742 5.5889 4.1477 1.0889 1.0325 1.1070 1.1065 1.1000 1.1036 1.0832
irintensity: 1.5044 0.4243 1.7636 1.5811 8.4894 1.0658 5.7382 12.0649 12.7700 13.4030 36.5649 86.2725 153.5251 29.3010 57.5971 31.0381 22.0896 29.7154 36.0840 117.7401 47.1480 40.4581 19.6153 0.2059 37.8953 136.7509 22.2456 18.8421 5.9727 10.3782 3.2240 17.7461 12.8710 64.6412 33.1613 186.7310 19.8335 3.8601 3.6662 9.7113 15.9241 201.4945
temp: 298.150 k
press: 1.00000 atm
elementType: 6 6 1 6 7 7 5 1 1 1 1 1 6 1 17 17
symmnumber: 1
zpe: 313254.3 jmol-1
zpe.correction: 0.119312 hartree
zpe.thermalcorrener: 0.128742 hartree
zpe.thermalcorrenthalpy: 0.129686 hartree
zpe.thermalcorrgfe: 0.082308 hartree
zpe.sumelectzpe: -1211.370122 hartree
zpe.sumelectthermal: -1211.360692 hartree
zpe.sumelectthermalent: -1211.359748 hartree
zpe.sumelectthermalfe: -1211.407126 hartree
dipole: 14.8144 -0.5388 1.8116
dipole: 14.9345
quadrupole: -57.5606 -70.3865 -65.8053
quadrupole: 4.1868 0.6855 3.4045
quadrupole: 7.0235 -5.8024 -1.2212 4.1868 0.6855 3.4045
hfenergy: -1211.4894339 hartree
pointgroup: C01 [X(C4H7B1Cl2N2)]
dipole: 5.828441 -0.2119856 0.7127408 debye
dipolederiv: 0.5709601 -0.084592 -0.2081276 -0.0816391 0.2205053 0.0155586 -0.2289666 0.0232647 0.2696679 -0.0757489 -0.0803675 -0.192046 0.1123923 -0.0960186 0.0228497 0.2018565 0.068822 0.0010788 0.1113794 -0.0040423 0.0134281 -0.0116092 0.1747411 -0.034774 0.0115096 -0.0442486 0.0967862 0.0342571 0.0921012 0.1181394 -0.0346775 -0.111515 -0.0400188 -0.2246313 -0.0396059 -0.1693233 -0.5075583 0.1743103 0.3713572 0.143272 -0.1290416 0.0116122 0.3876224 -0.0033296 -0.1838106 -0.4635287 0.139927 0.2681939 0.1607098 -0.192355 -0.0219845 0.3703498 -0.0542361 -0.3375669 1.0835013 -0.1921305 0.0109236 -0.3494886 0.8184641 0.2962798 0.1066761 0.2848746 1.6398892 0.4219919 -0.0356822 -0.0130165 -0.0595954 0.2996848 0.0077545 -0.074059 0.0171196 0.3418963 -0.2942149 -0.0246784 0.0215914 -0.0108515 -0.3818689 0.0532007 -0.0026873 0.051225 -0.2554726 0.01626 0.0474494 -0.0098515 0.0104564 0.0662378 0.0717942 0.0626829 0.0437561 -0.0211295 -0.0060416 -0.0025157 0.0124623 -0.0482295 0.083245 -0.0565626 -0.0754153 -0.0655325 0.0025014 0.0142381 -0.0230576 0.0454189 0.0543831 -0.0527311 -0.0361004 0.0554153 -0.004714 0.0832024 0.2028159 -0.1633492 -0.405958 -0.2102403 0.114718 0.0520384 -0.5014985 0.0545892 0.2652007 0.086942 -0.0015468 0.0049276 0.0008651 0.1887831 -0.029335 0.0319673 -0.0207103 0.1556296 -0.5671615 0.0072211 -0.2321015 0.0692042 -0.3632499 0.0934251 -0.319605 -0.0249699 -1.0753507 -0.628092 0.1509532 0.1946589 0.2550481 -0.6395991 -0.4057378 0.1987831 -0.2863043 -0.8131988 unknown
polarizability: 131.6738264|-2.7063628|85.8782452|-1.3374936|14.1486195|115.1309584 unknown
InChI: InChI=1/C4H7BCl2N2/c1-9-2-4(5(6)7)8-3-9/h2-3,5,8H,1H3
charge 0 multiplicity 1
16 atoms
C  3.69406621 -0.25056398 -0.74505594
C  1.17339072 -0.37488135 -0.66567929
H  1.10018449 -0.81672748 -1.64463436
C  0.19335675 -0.02832066 0.2186615
N  2.39696941 -0.04389602 -0.11452551
N  0.87695205 0.5069456 1.29223994
B  -1.40424447 -0.2067675 0.20176135
H  0.40833879 0.89902786 2.09890453
H  -1.73947421 -1.30353153 0.55841255
H  3.71413273 0.26341424 -1.7051026
H  4.47248786 0.15448945 -0.10136055
H  3.86215777 -1.31678278 -0.89201943
C  2.18927423 0.49586696 1.08037999
H  2.94933441 0.86432808 1.74783212
Cl -2.03859722 0.10064918 -1.54279832
Cl -2.13123151 1.05653894 1.43008203
