program: Gaussian 16
title: cl_xanthene_h2
version: AS64L-G16RevC.02
method: RwB97XD
basis: GenECP
operation: Freq
keyword: #N
keyword: Geom=AllCheck
keyword: Guess=TCheck
keyword: SCRF=Check
keyword: GenChk
keyword: RwB97XD/GenECP
keyword: Freq
converged: YES YES YES YES
title: Mulliken charges:
elementType: C C C C C C H H H C O C H H H C H H H C C C C C H C H H B N C H H H C H H H H H Cl Cl
charge: 0.393701 -0.099276 -0.690590 -0.099425 0.299673 -0.267666 0.157179 0.238053 0.165550 -0.090688 -0.036668 -0.475610 0.163242 0.176048 0.202756 -0.797666 0.195135 0.182725 0.218173 0.089229 -0.091905 0.149193 0.563446 -0.678544 0.196186 -0.880345 0.260157 0.212598 -0.599949 0.234143 -0.371610 0.226347 0.238523 0.255147 -0.280176 0.271036 0.223715 0.203610 0.166694 0.033283 -0.201024 -0.054402
chargesum: -0.00000
title: Mulliken charges with hydrogens summed into heavy atoms:
elementType: C C C C C C C O C C C C C C C C B N C C Cl Cl
charge: 0.393701 0.057903 -0.452536 0.066125 0.299673 -0.267666 -0.090688 -0.036668 0.066436 -0.201633 0.089229 -0.091905 0.345379 0.563446 -0.418386 -0.667748 -0.433254 0.267426 0.348407 0.418184 -0.201024 -0.054402
1716.lowfreq: -11.7726 -5.1160 -0.0022 -0.0022 0.0002 8.8535 25.9374 45.6945 52.5636
frequency: 24.7131 45.6295 52.5301 68.9040 88.6109 107.0548 140.9921 149.2983 159.2246 177.4772 194.0702 214.4974 226.7348 244.4519 249.6758 259.4402 279.1372 287.7323 302.0685 303.7575 313.2286 343.0599 357.2577 388.0812 414.5899 436.5836 455.5602 502.2608 527.8068 542.1574 555.0793 569.5455 576.8451 597.7840 630.2733 634.2730 659.6689 676.7118 689.7009 739.9377 771.5576 780.8395 814.8552 823.0138 831.7560 859.8572 887.9666 911.0802 942.0663 944.4502 952.2782 964.2940 1001.8707 1008.9005 1010.8401 1033.1162 1035.3549 1043.7486 1063.6357 1082.6430 1100.8622 1106.7663 1150.1758 1168.3435 1173.0976 1186.2970 1197.1149 1198.0354 1202.0979 1239.5166 1250.0412 1277.1638 1281.4285 1296.5222 1305.5857 1325.6924 1336.3363 1348.7867 1405.0286 1428.1221 1438.8940 1451.2783 1467.5571 1471.5345 1481.9448 1483.6014 1485.6734 1492.6024 1504.0345 1504.6253 1512.1107 1513.3913 1515.9069 1521.3514 1530.2456 1540.0724 1642.7147 1665.4603 1680.6648 1700.3234 2469.8787 3040.9244 3055.6407 3086.1005 3087.6428 3122.5472 3131.5049 3131.7603 3140.0750 3177.2145 3187.9220 3189.7471 3193.5600 3196.7277 3201.0929 3204.2735 3206.5159 3214.1612 3215.0229 3226.4534
redmass: 10.7097 5.2878 4.4386 4.5813 2.9721 8.2484 4.3457 3.1485 3.5268 3.1757 8.7869 1.1260 6.2905 2.1366 1.4468 1.7727 3.7538 2.8773 2.9776 1.4169 3.1551 3.3907 1.7440 3.5595 4.3902 4.5967 3.5374 5.3338 4.7689 4.2919 3.8655 4.6708 4.2532 4.5940 4.2867 4.7926 4.6744 6.0699 6.1173 3.6074 1.8015 1.7892 2.3614 2.9010 4.3528 5.0089 3.1679 6.1964 1.6121 1.3998 1.7376 1.8591 1.9920 1.3597 1.3416 1.3251 2.0238 1.1103 1.3263 1.1863 2.0107 2.2148 1.9638 2.2105 1.6777 3.0234 1.8731 1.5061 1.2959 2.8946 2.4531 1.8849 2.2407 2.3043 2.3864 3.7838 3.7257 5.2228 1.2305 1.2321 1.6346 1.1533 1.9660 1.2220 1.0920 1.0461 1.1172 1.1274 1.2051 1.1610 1.1249 1.1572 1.5810 1.1661 2.4590 2.6868 5.8508 7.6366 7.9568 7.6758 1.0867 1.0346 1.0364 1.0315 1.0309 1.1032 1.1018 1.1033 1.1024 1.0901 1.0870 1.1083 1.1069 1.1040 1.1023 1.0887 1.0914 1.0920 1.0956 1.0970
irintensity: 0.4885 6.0055 1.9850 9.4315 5.0918 12.3002 1.8865 0.2194 7.3986 0.5514 7.0723 0.0205 1.8318 0.5289 0.5566 5.3977 2.9056 1.7604 0.2406 0.7571 0.1533 2.2448 1.6623 1.3702 6.7256 0.0426 4.0966 60.2130 5.4226 15.5062 14.4084 22.8428 25.2615 17.8611 26.1836 2.1232 43.3532 113.1415 4.3037 17.9703 15.7745 80.6071 8.5494 13.8965 16.3340 3.0836 3.4713 27.7154 1.1502 1.5000 5.8783 9.3592 23.6094 1.8770 2.2283 0.8436 13.4742 125.0522 155.2654 4.7877 41.3340 19.7283 18.8968 42.0505 13.0435 32.3044 11.1775 16.3864 1.8724 122.1616 14.4969 17.2613 16.4202 33.3933 0.2482 89.9684 69.3705 12.8073 10.3742 8.8652 220.7853 13.8062 124.9755 19.1779 9.2048 1.3776 5.0691 36.8890 25.2139 9.6929 20.7150 23.9485 9.8501 13.7615 106.3400 112.9500 12.5073 3.1889 24.7407 10.9385 220.1307 31.9398 24.4498 24.3484 9.3578 20.0573 36.4481 19.3825 24.7633 532.3864 5.5187 0.2721 24.7000 61.7295 74.9373 4.4952 5.4163 3.9987 27.2188 6.9551
temp: 298.150 k
press: 1.00000 atm
elementType: 6 6 6 6 6 6 1 1 1 6 8 6 1 1 1 6 1 1 1 6 6 6 6 6 1 6 1 1 5 7 6 1 1 1 6 1 1 1 1 1 17 17
symmnumber: 1
zpe: 903242.2 jmol-1
zpe.correction: 0.344027 hartree
zpe.thermalcorrener: 0.364751 hartree
zpe.thermalcorrenthalpy: 0.365695 hartree
zpe.thermalcorrgfe: 0.294825 hartree
zpe.sumelectzpe: -1734.783228 hartree
zpe.sumelectthermal: -1734.762504 hartree
zpe.sumelectthermalent: -1734.761560 hartree
zpe.sumelectthermalfe: -1734.832430 hartree
dipole: 13.1716 8.9452 0.1790
dipole: 15.9229
quadrupole: -172.9293 -104.9539 -149.9342
quadrupole: -5.1992 -2.2728 -0.8079
quadrupole: -30.3235 37.6519 -7.3284 -5.1992 -2.2728 -0.8079
hfenergy: -1735.1272548 hartree
pointgroup: C01 [X(C17H20B1Cl2N1O1)]
dipole: 5.1821119 3.5193132 0.0704173 debye
polarizability: 326.3204221|3.967396|321.5620879|2.4782932|11.6849348|198.8161394 unknown
InChI: InChI=1/C17H20BCl2NO/c1-17(2)11-7-5-9-13(18(19)20)15(11)22-16-12(17)8-6-10-14(16)21(3)4/h5-10,18,21H,1-4H3
charge 0 multiplicity 1
42 atoms
C  -1.50818244 -1.42032447 -0.28768617
C  -1.74102818 -2.731323 -0.70851122
C  -0.70741845 -3.6597225 -0.80317353
C  0.60272186 -3.30071182 -0.50911457
C  0.8908439 -2.01342966 -0.05792286
C  -0.19097099 -1.15212697 0.07223324
H  -2.74502905 -3.01743633 -1.00041626
H  -0.92024452 -4.66838199 -1.14008379
H  1.39434581 -4.02974864 -0.63252517
C  2.29119954 -1.50984753 0.31654639
O  0.04584588 0.12828466 0.55678525
C  3.39226689 -2.29446075 -0.39972346
H  4.3794908 -1.92920467 -0.1075732
H  3.35564387 -3.34870539 -0.12021573
H  3.29694376 -2.21983541 -1.48572238
C  2.47519707 -1.65599744 1.84517913
H  2.40813384 -2.71032182 2.12529832
H  3.45319561 -1.27245035 2.15007125
H  1.70195531 -1.11093979 2.39140033
C  2.35846671 -0.01921679 -0.02185004
C  1.19249986 0.7119619 0.16827946
C  3.47893221 0.69504551 -0.43491891
C  1.12917077 2.08150569 -0.03057888
C  3.42997434 2.07610244 -0.62623048
H  4.41600796 0.17978204 -0.60679816
C  2.25262842 2.78696023 -0.4233161
H  4.32188812 2.60418755 -0.93954064
H  2.22058644 3.85847155 -0.58302267
B  -2.55048898 -0.19615486 -0.44928968
N  -0.19410591 2.68761812 0.17452523
C  -0.22624235 3.63614798 1.32417603
H  0.40291664 4.49504206 1.09624624
H  -1.25827753 3.94674665 1.4790724
H  0.14394807 3.11678928 2.20568681
C  -0.75499309 3.2854636 -1.07216465
H  -1.78529441 3.57590558 -0.87345633
H  -0.15767451 4.15172036 -1.35232576
H  -0.72855943 2.52846518 -1.85278928
H  -2.13063472 0.60498606 -1.25372543
H  -0.8320435 1.90619237 0.43273717
Cl -4.25282701 -0.76252919 -1.00968224
Cl -2.79043762 0.85106755 1.18356639
