program: Gaussian 16
title: MeQHBCN2-H2
version: ES64L-G16RevC.01
method: RwB97XD
basis: GenECP
operation: Freq
keyword: #N
keyword: Geom=AllCheck
keyword: Guess=TCheck
keyword: SCRF=Check
keyword: GenChk
keyword: RwB97XD/GenECP
keyword: Freq
converged: YES YES YES YES
title: Mulliken charges:
elementType: C C H C N N N B H H H H H C N C N
charge: -0.406314 -0.386002 0.296723 -0.177956 0.267249 -0.032685 -0.142812 0.322394 0.417885 0.218935 0.221159 0.233292 0.112406 -0.144758 -0.344194 -0.096796 -0.358526
chargesum: -0.00000
title: Mulliken charges with hydrogens summed into heavy atoms:
elementType: C C C N N N B C N C N
charge: 0.267071 -0.089279 -0.177956 0.267249 -0.032685 0.275074 0.434800 -0.144758 -0.344194 -0.096796 -0.358526
1716.lowfreq: 0.0001 0.0002 0.0004 4.2180 8.0483 16.1384 31.8132 78.2047 83.0253
frequency: 30.5569 78.1678 82.9778 97.3188 113.9851 201.6488 246.0151 317.4681 350.2546 393.7671 417.9894 488.1532 506.9821 625.8148 692.2205 716.6771 753.1040 799.9161 816.3491 851.8626 882.4399 1027.8869 1084.7577 1091.2304 1100.6186 1102.7514 1159.8803 1188.7799 1260.7248 1334.8830 1424.1556 1454.1455 1463.7109 1487.5235 1499.3704 1521.8073 1630.2019 2337.2005 2343.5791 2502.6502 3091.8270 3184.5377 3208.1367 3309.6342 3614.4178
redmass: 4.6822 6.1784 1.0943 7.8644 8.3458 4.6484 5.2665 5.1999 7.2404 4.9360 5.6169 7.1388 11.4987 4.0357 6.4177 4.7931 3.6075 1.2058 3.3582 1.5436 2.1701 1.9197 1.9896 2.9872 1.9750 2.2347 1.3478 1.6900 2.1300 7.1296 3.3157 2.0706 1.5379 1.0444 2.4596 1.4939 3.6413 12.7222 12.7161 1.0861 1.0323 1.1074 1.1071 1.1024 1.0849
irintensity: 0.4253 2.8007 0.1001 15.3862 10.8582 8.3079 0.7632 4.8214 4.5288 2.6126 3.0500 2.4316 0.9857 4.6178 3.7951 4.9503 23.2885 70.3174 11.9589 31.1612 6.7570 52.1883 2.7020 29.6999 21.2214 96.7350 1.0998 74.9979 78.4509 0.7919 15.3432 7.1656 5.4397 20.6208 24.1998 10.2047 32.4966 10.0162 9.7194 90.3233 7.4523 0.8919 0.0036 12.0465 198.1440
temp: 298.150 k
press: 1.00000 atm
elementType: 6 6 1 6 7 7 7 5 1 1 1 1 1 6 7 6 7
symmnumber: 1
zpe: 322322.3 jmol-1
zpe.correction: 0.122766 hartree
zpe.thermalcorrener: 0.133305 hartree
zpe.thermalcorrenthalpy: 0.134249 hartree
zpe.thermalcorrgfe: 0.084981 hartree
zpe.sumelectzpe: -492.568642 hartree
zpe.sumelectthermal: -492.558104 hartree
zpe.sumelectthermalent: -492.557159 hartree
zpe.sumelectthermalfe: -492.606427 hartree
dipole: 9.2693 9.6557 -4.2572
dipole: 14.0455
quadrupole: -88.2251 -103.6574 -85.6249
quadrupole: -29.8808 10.3657 19.3851
quadrupole: 4.2774 -11.1549 6.8776 -29.8808 10.3657 19.3851
hfenergy: -492.6914082 hartree
pointgroup: C01 [X(C5H6B1N5)]
dipole: 3.6468132 3.7988556 -1.6748955 debye
dipolederiv: 0.4798999 0.216631 0.0065857 0.1780505 0.3125489 -0.0106552 0.0167838 0.0041479 0.1184533 -0.1720436 -0.0277658 0.3237448 -0.0931973 -0.0757474 0.2024786 -0.0556162 -0.0187864 -0.0017332 0.137791 -0.0366372 -0.008944 -0.0303886 0.1785889 -0.0127743 -0.0034876 -0.0134884 0.135772 0.250031 0.0984115 -0.3249674 0.151578 0.0670321 -0.2152389 0.0257261 0.0286638 -0.2248974 -0.2441395 -0.1723887 -0.1467428 -0.1571227 -0.160236 -0.0273101 -0.2811942 -0.126574 0.3509306 -0.0248631 0.0616629 0.3555095 0.0734966 0.0081875 0.1469939 0.4151826 0.2162882 -0.5722546 -0.2930992 -0.1956348 -0.2958826 -0.1569852 -0.2482417 -0.126082 -0.2281999 -0.112444 0.1806208 0.5787491 0.1253711 0.07532 0.1995368 0.5993409 -0.0710196 0.0565197 -0.0497644 0.7341026 0.354898 0.056256 0.0498339 0.0553002 0.3543347 0.0229388 0.0576246 0.0340452 0.3435106 0.0252865 -0.0466373 -0.0170389 0.0058633 0.0450157 0.0731032 -0.0615247 0.0440607 0.0481136 0.0702688 -0.0457032 -0.0172773 -0.0179403 0.0958117 -0.0500734 0.0515646 -0.006241 0.0199938 -0.0040183 0.0305337 0.023969 -0.0312302 -0.019214 -0.0236315 0.0112209 -0.0366308 0.1104726 -0.2489082 0.0385076 0.0227133 0.028346 -0.2396539 -0.0032329 0.0302363 -0.0106818 -0.1839369 -0.0214755 0.0125701 0.0577983 -0.0450977 -0.0247869 0.0886564 0.0346601 0.1164775 -0.0454496 -0.4399884 -0.0607744 -0.049405 -0.0758758 -0.4306758 -0.0755976 -0.0760514 -0.0829666 -0.4812939 -0.0715294 -0.0847918 -0.0048464 -0.0957013 -0.0577255 -0.003241 0.012884 -0.0732263 0.0309107 -0.3768591 0.0303893 -0.0503703 0.0113678 -0.4045791 0.0846857 -0.0063288 0.0871205 -0.5633149 unknown
polarizability: 108.1158146|23.5304723|95.055109|2.3530305|-0.8575223|121.7414503 unknown
InChI: InChI=1/C5H6BN5/c1-11-2-5(9-10-11)6(3-7)4-8/h2,6,9H,1H3
charge 0 multiplicity 1
17 atoms
C  1.45833052 0.33044454 0.03889458
C  -0.53298591 -0.80143203 1.10440471
H  -0.29122165 -0.49671022 2.10814333
C  -1.57678363 -1.55320654 0.61417617
N  0.23979525 -0.47206784 0.04088991
N  -0.22318832 -0.95134764 -1.07874469
N  -1.30576593 -1.59329057 -0.71361941
B  -2.86577654 -2.23995971 1.30198701
H  -1.84354305 -2.08321124 -1.42025918
H  2.14560343 -0.0731957 0.77991133
H  1.89564754 0.26805753 -0.95398409
H  1.2072754 1.36294203 0.27657132
H  -3.66912856 -1.37995949 1.57311851
C  -3.50325152 -3.22978371 0.23956444
N  -3.91879882 -3.88011012 -0.61861404
C  -2.42048686 -2.97806799 2.62979941
N  -2.06986523 -3.46840668 3.61330847
