program: Gaussian 16
title: MeQHBFA-H2
version: ES64L-G16RevC.01
method: RwB97XD
basis: GenECP
operation: Freq
keyword: #N
keyword: Geom=AllCheck
keyword: Guess=TCheck
keyword: SCRF=Check
keyword: GenChk
keyword: RwB97XD/GenECP
keyword: Freq
converged: YES YES NO YES
title: Mulliken charges:
elementType: C C H C N N N B H H H H H C O O H C O O H
charge: -0.388640 -0.505859 0.284449 0.060847 0.248873 0.096170 -0.343291 0.170745 0.451725 0.223830 0.222173 0.220930 0.097060 -0.193849 -0.387821 -0.155062 0.306434 -0.175911 -0.385411 -0.149368 0.301974
chargesum: -0.00000
title: Mulliken charges with hydrogens summed into heavy atoms:
elementType: C C C N N N B C O O C O O
charge: 0.278293 -0.221410 0.060847 0.248873 0.096170 0.108434 0.267806 -0.193849 -0.387821 0.151372 -0.175911 -0.385411 0.152606
1716.lowfreq: -8.6903 -0.0003 0.0008 0.0008 5.3920 14.3646 29.1962 41.4722 51.2658
frequency: 29.1699 41.4031 45.6573 88.9259 100.3683 138.0749 194.1026 231.1203 266.1313 319.2139 330.1371 336.8874 420.5831 437.8057 498.2242 635.3188 652.8600 653.5112 685.5801 692.2576 703.3738 725.8235 799.7994 850.3677 861.0816 880.1435 925.2687 1013.2967 1049.8341 1079.3453 1087.3610 1102.9841 1158.7572 1168.4465 1184.8910 1224.4061 1241.8761 1337.1585 1344.2478 1360.4025 1398.8121 1449.2217 1453.8746 1483.5516 1486.8736 1519.8248 1615.7038 1708.3203 1747.0099 2447.7966 3088.8146 3178.7664 3202.5596 3320.5503 3448.7897 3793.2587 3796.5622
redmass: 1.0566 7.5776 8.2165 7.4933 5.1752 5.0417 7.1058 4.2635 6.2255 7.5768 7.8337 6.2520 3.4190 4.7263 1.7837 1.7769 2.3089 3.0408 2.9220 2.3057 3.4018 4.2845 2.4138 2.0729 3.3749 2.4250 1.1313 1.7831 2.3077 1.7404 3.8417 2.7147 1.3391 1.7854 2.5302 1.9581 1.8357 2.3827 5.3018 3.2903 3.3778 1.8054 2.3565 2.3470 1.0361 1.4500 4.6283 7.3034 9.4037 1.0850 1.0323 1.1073 1.1065 1.1023 1.0890 1.0639 1.0640
irintensity: 0.2393 5.3929 0.2024 1.6500 1.3894 3.0756 7.4121 3.1972 9.4250 13.4530 9.3839 14.5640 6.0501 11.2023 2.0045 84.0628 129.1160 28.1006 54.7386 38.4814 76.7857 26.7941 7.9109 10.5822 49.2139 1.5363 113.3169 42.0538 27.1266 185.5083 109.8309 12.0548 0.3064 429.7583 33.7022 280.2891 41.2072 21.4424 3.9946 130.6532 21.3465 28.1811 6.5387 35.2219 19.0277 6.9668 91.6682 339.0412 386.9412 99.7636 13.0039 2.1227 0.1352 14.0837 534.5670 66.1286 49.7031
temp: 298.150 k
press: 1.00000 atm
elementType: 6 6 1 6 7 7 7 5 1 1 1 1 1 6 8 8 1 6 8 8 1
symmnumber: 1
zpe: 406948.6 jmol-1
zpe.correction: 0.154999 hartree
zpe.thermalcorrener: 0.167523 hartree
zpe.thermalcorrenthalpy: 0.168467 hartree
zpe.thermalcorrgfe: 0.113924 hartree
zpe.sumelectzpe: -685.200100 hartree
zpe.sumelectthermal: -685.187576 hartree
zpe.sumelectthermalent: -685.186632 hartree
zpe.sumelectthermalfe: -685.241174 hartree
dipole: 5.6592 4.4835 -1.8250
dipole: 7.4471
quadrupole: -82.4048 -81.9095 -83.1376
quadrupole: -6.2937 6.5163 6.5697
quadrupole: 0.0792 0.5745 -0.6537 -6.2937 6.5163 6.5697
hfenergy: -685.3550987 hartree
pointgroup: C01 [X(C5H8B1N3O4)]
dipole: 2.2264909 1.7639606 -0.71801 debye
dipolederiv: 0.4939381 0.2035495 0.0203112 0.2035258 0.3339132 0.0123962 0.0197008 0.0130233 0.1268059 -0.1623614 -0.0542269 0.3312409 -0.0681461 -0.0927537 0.1852329 -0.1088684 -0.089034 0.0317852 0.1370043 -0.0306051 -0.0234623 -0.0177286 0.1866872 -0.0088787 -0.0171321 -0.0265974 0.1498934 0.2725912 0.1584653 -0.317014 0.1477531 0.0834243 -0.1936654 0.0290765 0.0470819 -0.2212365 -0.3027733 -0.1841616 -0.1189084 -0.1699807 -0.1733329 -0.0757211 -0.2794041 -0.1698243 0.3541083 -0.0159683 0.0384687 0.3496216 0.0455535 -0.0505093 0.2146202 0.4179369 0.2711538 -0.5574342 -0.4036721 -0.2356682 -0.3265925 -0.2251307 -0.2746838 -0.1852251 -0.249116 -0.1695348 0.1527174 0.3575695 0.1461264 -0.0973979 0.1549414 0.2831558 -0.0580812 -0.1013256 -0.0588376 0.1552601 0.5978922 0.2602494 0.0458083 0.2662469 0.5094069 0.0144033 0.1201268 0.0851725 0.3522752 -0.0102678 -0.0379611 -0.0263875 0.026401 0.0114149 0.0605973 -0.0625281 0.0375203 0.0774846 0.0686329 -0.0378099 -0.0283222 -0.0356397 0.0983072 -0.0215582 0.0476838 0.0282204 -0.0001668 0.003236 0.0216242 0.0431653 -0.0428524 -0.0121047 -0.0482238 0.0090391 -0.0710069 0.0808705 -0.2783694 0.0269072 0.0530544 0.0632119 -0.2179732 -0.0255774 0.0534969 -0.0137821 -0.1507846 1.1472271 0.7711374 -0.2974552 0.7547531 0.8539584 -0.0469437 -0.4044372 -0.1699815 1.5429162 -0.8310902 -0.3331792 0.0368365 -0.3235136 -0.6671764 -0.1070071 0.3620109 0.224747 -1.5641493 -1.1282806 -0.6002963 0.2953944 -0.6246748 -0.9019522 0.2599969 0.1060151 0.1038788 -0.4161607 0.363128 -0.0009706 0.027491 -0.0017528 0.3562233 0.0027436 -0.037958 -0.051501 0.187527 1.4618582 0.7002335 0.2075665 0.690681 1.0001736 -0.4657632 0.2239508 -0.4440446 1.104606 -1.227751 -0.3854541 -0.2824958 -0.225814 -0.6542236 0.1848621 -0.5206856 -0.0303013 -0.999871 -0.8098932 -0.4378272 0.2292904 -0.5923566 -1.0207857 0.3200222 0.4493313 0.4502244 -0.6562102 0.26735 0.0113985 -0.121745 -0.0254777 0.3488309 -0.01823 -0.056914 0.0334231 0.2497636 unknown
polarizability: 126.5245958|33.3311892|103.7731302|-1.6966089|-6.9129147|127.4679685 unknown
InChI: InChI=1/C5H8BN3O4/c1-9-2-3(7-8-9)6(4(10)11)5(12)13/h2,6-7,10,12H,1H3
charge 0 multiplicity 1
21 atoms
C  1.51746496 0.41963434 0.0836576
C  -0.43553926 -0.8334056 1.07655145
H  -0.16400325 -0.6565495 2.10196167
C  -1.48977676 -1.53860403 0.53456298
N  0.29803089 -0.37556239 0.0336074
N  -0.19762688 -0.73413393 -1.1219885
N  -1.26207975 -1.42146704 -0.79608553
B  -2.74595515 -2.32140124 1.16263862
H  -1.85119157 -1.89277352 -1.48914889
H  2.28436027 -0.13524489 0.62195867
H  1.83635808 0.60389331 -0.9389709
H  1.31061534 1.36218182 0.58814366
H  -3.58050011 -1.50271293 1.50041038
C  -3.46461025 -3.21583347 0.0175235
O  -3.23062675 -3.14129026 -1.1870247
O  -4.44105825 -4.03615141 0.42591068
H  -4.80964704 -4.45531874 -0.36397791
C  -2.28328766 -3.05464054 2.5306187
O  -1.28307866 -2.76852203 3.16587991
O  -3.12371858 -3.99226937 3.01642512
H  -2.7502865 -4.29177649 3.85644388
