program: Gaussian 16
title: Me_5cyclo-H2
version: ES64L-G16RevC.01
method: RwB97XD
basis: GenECP
operation: Freq
keyword: #N
keyword: Geom=AllCheck
keyword: Guess=TCheck
keyword: SCRF=Check
keyword: GenChk
keyword: RwB97XD/GenECP
keyword: Freq
converged: YES YES YES YES
title: Mulliken charges:
elementType: H C C C C H C H C H C H H H C H H H N H H B C C C H H C H H H H H H
charge: 0.219898 -0.438760 -0.197968 -0.467471 0.308276 0.191969 -0.183120 0.227773 -0.166005 0.187377 -0.325254 0.238387 0.212534 0.199886 -0.366834 0.211671 0.207687 0.201101 0.248089 -0.055611 0.162531 -0.230971 -0.369098 -0.373574 -0.408403 0.117580 0.156099 -0.317178 0.117339 0.106961 0.139782 0.146810 0.165710 0.132788
chargesum: -0.00000
title: Mulliken charges with hydrogens summed into heavy atoms:
elementType: C C C C C C C C N B C C C C
charge: -0.218862 -0.005999 -0.239699 0.308276 0.004257 -0.166005 0.325552 0.253625 0.410620 -0.286583 -0.095419 -0.149274 -0.121811 -0.018680
chargesum: 0.00000
1716.lowfreq: -14.5345 -7.9710 -0.0005 -0.0004 -0.0003 9.5047 32.3154 49.2845 79.1367
frequency: 31.8268 49.1477 79.0501 88.3209 132.7701 176.5667 199.5859 224.9088 243.5975 259.0495 291.5937 309.2232 360.9846 374.1408 482.6733 499.1883 519.8454 561.2295 576.8477 592.6747 602.8439 692.5180 755.2372 765.7312 775.8098 789.7051 825.2804 854.6890 884.4903 897.5872 901.7801 913.1964 955.0445 960.0375 976.1193 993.8187 1020.2944 1027.8449 1041.2178 1048.4313 1064.9425 1080.7971 1087.1997 1100.8875 1144.2217 1159.3267 1171.1380 1190.4507 1203.6257 1206.7276 1222.8230 1242.5309 1262.6405 1282.1374 1284.1637 1292.0564 1312.5284 1328.4946 1332.2118 1343.9651 1449.0418 1453.5019 1466.9135 1472.4162 1481.6917 1485.5868 1489.9335 1490.6995 1492.4202 1504.9887 1509.7907 1514.9858 1529.8034 1546.0083 1638.2414 1675.1097 2061.6532 2875.9132 2997.8036 3006.4304 3008.5115 3013.2259 3037.1422 3050.0826 3055.4008 3066.8110 3076.6709 3083.0176 3172.7534 3175.9896 3179.6856 3185.6294 3187.2504 3189.6623 3196.6141 3212.8138
redmass: 2.6773 3.2496 2.5650 2.9581 3.1952 2.9407 1.0869 2.6033 2.3057 1.3085 1.8537 2.4743 3.1679 3.4693 2.3018 2.5589 3.0195 2.7423 3.2211 2.8117 3.5916 3.7802 1.7101 1.6309 3.8956 2.2297 2.0178 2.0545 1.5543 1.7444 2.5310 1.8909 2.9637 1.5402 1.4004 1.7180 1.3360 1.4725 1.5859 1.8045 1.8148 1.6685 1.2159 2.8072 1.6935 1.8836 1.5722 1.1907 1.5873 2.2459 1.4983 1.4741 1.4367 1.5696 1.3439 1.5368 1.5879 1.9733 1.9705 1.3895 1.1864 1.3091 1.0886 1.1096 1.0943 1.1504 1.0893 1.1046 1.9365 1.1285 1.0653 1.1930 1.6002 1.1441 5.2815 5.7944 1.0757 1.0866 1.0580 1.0612 1.0638 1.0718 1.0988 1.0953 1.0995 1.1014 1.0316 1.0324 1.1074 1.1051 1.0868 1.0953 1.1069 1.1025 1.0937 1.0981
irintensity: 0.4329 3.1510 0.5816 0.4716 3.5366 22.7162 0.0341 1.3085 2.5632 6.2393 1.2619 1.0699 1.1934 1.4819 4.2348 9.8707 7.2639 6.1362 8.1017 3.5384 1.2175 2.0547 35.3389 25.3819 1.5546 14.6921 2.5472 4.3372 4.0432 0.5962 0.9768 3.8268 18.1783 8.5283 0.3834 1.6277 3.9447 8.6401 0.6079 16.3949 13.4605 9.3435 1.1382 20.6858 8.9145 9.3424 5.1999 0.7407 4.3275 5.8157 63.5682 0.4308 57.5926 12.5270 17.8766 13.8204 99.1297 1.6075 3.3930 0.0095 25.1558 93.6678 1.8528 2.3436 7.0032 9.8810 6.9402 4.5871 6.8138 2.6238 17.7519 9.4228 81.0464 9.5397 14.5023 5.5932 695.3917 1061.1457 89.6744 53.3937 86.7674 41.2168 81.1078 126.9531 79.5932 150.5502 10.6558 12.2289 3.9327 12.3572 5.1482 1.3439 0.4408 3.8314 31.5810 20.5855
temp: 298.150 k
press: 1.00000 atm
elementType: 1 6 6 6 6 1 6 1 6 1 6 1 1 1 6 1 1 1 7 1 1 5 6 6 6 1 1 6 1 1 1 1 1 1
symmnumber: 1
zpe: 796006.9 jmol-1
zpe.correction: 0.303183 hartree
zpe.thermalcorrener: 0.316980 hartree
zpe.thermalcorrenthalpy: 0.317924 hartree
zpe.thermalcorrgfe: 0.262251 hartree
zpe.sumelectzpe: -548.561457 hartree
zpe.sumelectthermal: -548.547660 hartree
zpe.sumelectthermalent: -548.546716 hartree
zpe.sumelectthermalfe: -548.602389 hartree
dipole: 0.5417 -8.9801 3.8121
dipole: 9.7708
quadrupole: -78.4613 -104.5140 -92.5197
quadrupole: -53.1958 22.8560 2.9813
quadrupole: 13.3704 -12.6823 -0.6881 -53.1958 22.8560 2.9813
hfenergy: -548.8646401 hartree
pointgroup: C01[X(C12H20B1N1)]
dipole: 0.2131282 -3.5330403 1.4997977 debye
polarizability: 200.1540318|9.7468116|207.7837499|3.8073297|-23.4869074|154.0056 unknown
InChI: InChI=1/C12H20BN/c1-14(2)12-8-4-3-7-11(12)13-9-5-6-10-13/h3-4,7-8,13-14H,5-6,9-10H2,1-2H3
charge 0 multiplicity 1
34 atoms
H  0.86864619 1.37205712 -0.78663719
C  1.85542022 0.98336969 -0.55761978
C  2.98166906 1.73679376 -0.8618101
C  1.98001504 -0.26899616 0.0401515
C  4.28468779 1.29128229 -0.58767349
H  2.85083671 2.70880155 -1.32623117
C  3.24588358 -0.75502334 0.33179004
H  1.10274063 -0.85912464 0.27773482
C  4.34309485 0.03292191 0.01213551
H  3.36208395 -1.72593971 0.80234604
C  6.04319611 -1.76500563 -0.22921258
H  5.81602458 -1.75228156 -1.2934821
H  7.10537041 -1.95252262 -0.07425234
H  5.45753051 -2.53733352 0.2671843
C  6.01455936 -0.33234372 1.78472526
H  5.38204422 -1.02613994 2.33801078
H  7.06612267 -0.57275118 1.94142979
H  5.81345849 0.69068034 2.09752442
N  5.70506994 -0.43881504 0.33713216
H  6.61803384 1.42409768 -0.97151394
H  6.28294894 0.28991376 -0.16472101
B  5.62491554 2.1905731 -0.82946366
C  5.56067484 3.22266964 -2.11085075
C  5.87921732 3.20729383 0.45866292
C  5.97651874 4.59114057 -1.53670042
H  4.54310916 3.30187592 -2.51781101
H  6.19515742 2.93167498 -2.95539456
C  5.47575142 4.58642297 -0.08917198
H  6.94229676 3.23534186 0.73554383
H  5.32317093 2.960303 1.37315087
H  7.07173341 4.67295267 -1.52807915
H  5.5986201 5.4449704 -2.11191658
H  5.8632397 5.42822654 0.49784685
H  4.38048584 4.67507598 -0.09030728
