program: Gaussian 16
title: cyclo_biphenylene_h2
version: AS64L-G16RevC.02
method: RwB97XD
basis: GenECP
operation: Freq
keyword: #N
keyword: Geom=AllCheck
keyword: Guess=TCheck
keyword: SCRF=Check
keyword: GenChk
keyword: RwB97XD/GenECP
keyword: Freq
converged: YES YES YES YES
title: Mulliken charges:
elementType: C C C C C C C H C H H C H C H C C H N C H H H C H H H H H B C H C H C H H C H H C H H H H
charge: 0.315297 0.136243 -0.104377 0.143067 -0.320578 -0.012367 -0.282565 0.218806 -0.556975 0.245847 0.209476 -0.532082 0.213413 -0.207732 0.227959 -0.085186 0.231118 0.180215 0.128837 -0.419750 0.215337 0.258687 0.234923 -0.364492 0.241332 0.218344 0.251730 0.276594 -0.025683 -1.024376 -0.338656 0.148805 -0.144708 0.083914 -0.290272 0.168863 0.173719 -0.180267 0.088592 0.168149 -0.457696 0.129183 0.171103 0.139358 0.128854
chargesum: -0.00000
title: Mulliken charges with hydrogens summed into heavy atoms:
elementType: C C C C C C C C C C C C N C C B C C C C C
charge: 0.315297 0.136243 -0.104377 0.143067 -0.101772 -0.012367 -0.036718 -0.347498 -0.318669 0.020227 0.095029 0.231118 0.405431 0.289197 0.346914 -1.050059 -0.050494 0.068059 0.052310 0.076474 -0.157409
1716.lowfreq: -9.0757 -0.0005 0.0001 0.0004 4.1843 10.1901 34.3790 63.1007 80.8861
frequency: 34.3244 63.0460 80.8320 93.5371 97.9279 112.0830 144.7287 161.2853 178.7714 198.4983 217.1512 223.3632 264.2071 286.1071 295.7872 305.5623 340.1568 350.8960 371.5239 401.8091 417.0659 450.1834 463.9821 481.8324 488.4049 532.0624 555.1918 589.9572 613.3140 637.3154 658.6526 680.6284 722.9544 736.0238 739.5159 750.6059 775.4562 783.7040 791.7111 820.6514 835.7616 849.8888 871.3662 882.1818 904.6120 923.9984 931.6269 958.0385 972.2968 990.7503 993.1002 993.9706 1006.8433 1008.7097 1036.7034 1038.9073 1049.3570 1059.3727 1078.6675 1084.0811 1093.6880 1105.1445 1110.0946 1148.7601 1163.1145 1177.5222 1185.9073 1187.1883 1197.4708 1206.6420 1215.0506 1241.9532 1254.4101 1256.9276 1266.9676 1292.2405 1296.2577 1307.6120 1315.5501 1329.3646 1365.8068 1381.5013 1383.2290 1409.0371 1433.4937 1450.6283 1461.6176 1464.9726 1468.5555 1482.0518 1486.3157 1488.7229 1489.5191 1492.0946 1498.9073 1502.5928 1503.6452 1507.3384 1515.3859 1524.4247 1569.9646 1646.2082 1664.8401 1693.0823 1754.7673 2078.8879 2886.2736 2959.9534 2983.4109 2993.3170 2999.6411 3006.8466 3009.3381 3024.2858 3039.5583 3045.7511 3057.8931 3082.0792 3087.3514 3174.3224 3180.4725 3183.7943 3191.9082 3192.1013 3194.8508 3201.5953 3208.2051 3210.6537 3219.3125
redmass: 4.1054 3.3396 4.0714 3.4053 3.1571 3.4946 3.4699 3.1527 3.3849 2.5672 2.6112 1.0809 1.2401 2.5166 2.9266 2.8447 3.1977 1.9084 4.2796 3.4232 3.8316 3.4844 4.3581 1.8742 2.9501 3.5831 3.4630 4.5901 5.1159 4.2193 4.5359 2.9894 2.6393 2.3611 2.6515 4.2396 1.5744 2.3607 1.5473 3.9781 2.4749 1.7934 2.6475 2.8073 1.4580 1.3584 1.3989 2.9045 1.8406 1.3115 1.4900 2.1607 1.7101 2.8114 1.7739 1.9145 2.3973 2.0812 1.1911 1.2295 1.5073 1.6014 1.7713 2.0851 2.4596 1.9154 1.7826 1.7945 1.9002 1.4461 1.6598 1.7525 1.6664 1.6221 1.7419 1.4628 1.6935 1.4507 2.6150 1.2734 1.3516 1.5091 1.5234 2.3297 2.4471 1.1392 1.1003 1.1491 1.0912 1.2031 1.0882 1.0795 1.1475 1.5675 1.7836 1.1125 1.1552 1.0679 1.3795 4.6069 1.2777 8.0339 7.1328 6.7423 8.6360 1.0688 1.0893 1.0586 1.0624 1.0854 1.0661 1.0705 1.0710 1.0932 1.1019 1.0963 1.0999 1.0313 1.0325 1.0861 1.1084 1.1071 1.1058 1.0924 1.0891 1.1070 1.0933 1.0956 1.0967
irintensity: 0.3240 0.5177 8.6996 5.4230 2.5931 3.8430 0.2414 15.0064 1.5326 1.9820 2.0373 0.0454 2.1292 0.1895 1.4127 1.7097 3.5646 0.1747 2.1178 1.4091 1.8978 1.3248 0.0521 1.8816 1.7843 1.9276 5.4852 1.3981 0.8071 7.9408 2.2642 3.9015 3.6154 20.2261 16.7461 5.0785 10.0316 10.6941 69.4145 0.8524 2.9241 5.3889 5.9458 8.8465 4.1328 5.5068 1.9762 45.6298 1.7195 0.4919 10.8095 30.8260 7.1506 9.3487 8.8469 10.1071 13.7116 10.7182 2.1450 0.5558 38.1413 60.6324 11.0823 58.5891 23.8361 14.3788 6.3820 0.8215 5.7941 23.3714 13.7543 0.1523 21.3441 18.8800 6.3466 4.0307 3.9815 6.8449 6.3862 0.4648 1.1260 2.5829 1.3043 3.3901 44.6282 6.5379 6.2192 22.5196 0.7005 2.6746 3.6752 8.1911 6.0751 5.4793 5.4278 39.0013 5.5973 36.5542 31.0943 7.9170 15.0779 1.4741 0.3199 1.5353 25.5404 756.1795 996.7864 115.6105 87.4645 50.1470 37.4864 170.9132 29.7404 99.7940 67.6121 161.3218 138.3795 4.3838 8.7186 4.1751 0.2904 6.4369 2.2681 34.3860 1.4918 1.7804 7.8331 31.4597 14.0252
temp: 298.150 k
press: 1.00000 atm
elementType: 6 6 6 6 6 6 6 1 6 1 1 6 1 6 1 6 6 1 7 6 1 1 1 6 1 1 1 1 1 5 6 1 6 1 6 1 1 6 1 1 6 1 1 1 1
symmnumber: 1
zpe: 1026296.7 jmol-1
zpe.correction: 0.390896 hartree
zpe.thermalcorrener: 0.409385 hartree
zpe.thermalcorrenthalpy: 0.410329 hartree
zpe.thermalcorrgfe: 0.345235 hartree
zpe.sumelectzpe: -817.541665 hartree
zpe.sumelectthermal: -817.523176 hartree
zpe.sumelectthermalent: -817.522231 hartree
zpe.sumelectthermalfe: -817.587325 hartree
dipole: 9.4105 -5.7214 -0.5052
dipole: 11.0248
quadrupole: -128.3933 -103.2136 -134.2121
quadrupole: -13.5619 1.6033 -3.0528
quadrupole: -6.4536 18.7260 -12.2724 -13.5619 1.6033 -3.0528
hfenergy: -817.9325608 hartree
pointgroup: C01 [X(C19H24B1N1)]
dipole: 3.7023754 -2.2509766 -0.1987653 debye
polarizability: 356.3150605|-26.6827026|314.640315|-25.9419063|1.6659563|194.37611 unknown
InChI: InChI=1/C19H24BN/c1-21(2)17-11-7-9-15-14-8-6-10-16(18(14)19(15)17)20-12-4-3-5-13-20/h6-11,20-21H,3-5,12-13H2,1-2H3
charge 0 multiplicity 1
45 atoms
C  0.33150409 1.10138205 0.21429225
C  1.06272024 2.2808444 -0.02845744
C  2.31104737 1.45294079 -0.28431679
C  1.55216347 0.28314579 -0.01662939
C  3.63615931 1.38360876 -0.599351
C  2.10630718 -0.95241995 -0.03127075
C  4.20774231 0.07900037 -0.63578205
H  4.24645352 2.25331138 -0.80993849
C  3.48049176 -1.05925806 -0.35812899
H  5.25765057 -0.02488039 -0.88402022
H  3.96981546 -2.02644174 -0.38956923
C  0.45924526 3.5081108 0.05770828
H  0.96413684 4.4511743 -0.11408569
C  -0.91239363 3.46047522 0.40219957
H  -1.45376295 4.39665248 0.49687839
C  -1.60060083 2.2694498 0.62081216
C  -1.00076056 0.98307875 0.52296927
H  -2.65204097 2.33794698 0.88214952
N  1.27662827 -2.11225665 0.32128825
C  1.14591213 -3.0985418 -0.7850537
H  2.11244526 -3.56919416 -0.96125375
H  0.40973896 -3.84647114 -0.49483824
H  0.80897299 -2.57332653 -1.67526954
C  1.71572538 -2.75101642 1.59269088
H  1.00218112 -3.53279808 1.85010388
H  2.71072814 -3.17310013 1.45971888
H  1.72809398 -1.98822943 2.36859727
H  0.31790704 -1.72189872 0.53474055
H  -0.83996587 -1.16887264 1.34641259
B  -1.65986308 -0.50289515 0.64698252
C  -3.11745749 -0.58252386 1.37454021
H  -3.13838349 -0.00679559 2.31083632
C  -1.75006415 -1.16388104 -0.86131545
H  -0.83568628 -0.98916664 -1.45118173
C  -2.94618241 -0.60724031 -1.64367941
H  -2.80464638 0.47149885 -1.79964215
H  -3.01569546 -1.05752837 -2.64254133
C  -4.27353763 -0.12360764 0.46957034
H  -4.20604356 0.95761508 0.29196303
H  -5.24427873 -0.28880567 0.95545637
C  -4.26158447 -0.82451574 -0.89125089
H  -4.4113044 -1.90361805 -0.74186675
H  -5.1039691 -0.4739448 -1.49949607
H  -3.3170089 -1.62553087 1.66556789
H  -1.86944029 -2.25835621 -0.79371236
