program: Gaussian 16
title: Me_cyclo-H2
version: ES64L-G16RevC.01
method: RwB97XD
basis: GenECP
operation: Freq
keyword: #N
keyword: Geom=AllCheck
keyword: Guess=TCheck
keyword: SCRF=Check
keyword: GenChk
keyword: RwB97XD/GenECP
keyword: Freq
converged: YES YES YES YES
title: Mulliken charges:
elementType: H C C C C H C H C H C H H H C H H H N H H B C C C C C H H H H H H H H H H
charge: 0.220898 -0.533155 -0.100138 -0.509844 0.353764 0.207851 -0.183630 0.230231 -0.042617 0.198816 -0.349429 0.238239 0.214772 0.201392 -0.374240 0.210525 0.224207 0.205416 0.166041 0.001167 0.199531 -0.646575 -0.173571 -0.297140 -0.383112 -0.362378 -0.340132 0.159763 0.138698 0.158997 0.137676 0.178441 0.124686 0.072659 0.168324 0.172698 0.111170
chargesum: -0.00000
title: Mulliken charges with hydrogens summed into heavy atoms:
elementType: C C C C C C C C N B C C C C C
charge: -0.312257 0.107713 -0.279613 0.353764 0.015186 -0.042617 0.304974 0.265908 0.365572 -0.645408 0.110297 -0.056158 -0.084651 -0.065705 -0.037006
chargesum: 0.00000
1716.lowfreq: -4.8924 0.0001 0.0002 0.0003 4.5659 13.9607 36.7731 71.8976 84.6358
frequency: 36.7643 71.8890 84.4899 90.0474 129.8033 174.4178 215.0313 223.5009 235.1276 249.1818 251.4629 294.7654 320.8397 356.7831 362.9684 413.7657 440.6822 481.9298 505.9363 513.2888 573.8883 592.7069 621.6922 715.4736 720.5220 761.8694 764.2851 789.2625 813.5181 835.6990 850.9343 878.7071 892.9925 917.5262 954.0432 957.8826 976.2086 988.0692 1021.0942 1033.8493 1045.5174 1047.8210 1053.6382 1075.5369 1087.7277 1093.7341 1103.5611 1122.4664 1147.4312 1158.4248 1172.9300 1189.8065 1207.2534 1214.2368 1240.1701 1245.0180 1275.1893 1283.9337 1290.0517 1305.0318 1311.9750 1330.1172 1335.4145 1364.5573 1379.0006 1382.5944 1450.2776 1452.8961 1459.4722 1463.6541 1481.7277 1482.3736 1485.6727 1487.0741 1492.0953 1495.4088 1500.2598 1506.5317 1514.1824 1528.5751 1548.7123 1638.9552 1675.8013 2007.4162 2861.0822 2972.8475 2977.4740 2994.5469 2997.6332 3005.3637 3011.4249 3026.4975 3034.2426 3040.2507 3056.4828 3078.5272 3082.0078 3172.8025 3176.2712 3178.8322 3185.5069 3187.6345 3190.7008 3195.8561 3212.4892
redmass: 3.0804 3.5683 3.0026 2.6955 3.0786 2.6088 3.2826 1.7673 1.3381 2.2982 1.1546 2.6506 2.3316 3.1897 1.9225 3.0664 2.4980 1.8647 3.2480 3.4017 3.4158 3.2083 4.3422 1.3984 2.6782 1.9231 3.2467 2.1554 2.6474 2.2661 1.4211 1.8445 1.4658 2.3313 2.8940 1.5025 1.3980 2.3233 1.3256 1.6577 1.7684 1.7821 1.5411 2.0849 1.2366 1.7377 3.0687 1.3618 1.4768 1.8096 1.6919 1.1769 2.2344 1.5064 1.4268 1.5110 1.6539 1.6195 1.3008 1.5057 1.4312 3.0981 1.4097 1.3536 1.5225 1.5089 1.1639 1.3354 1.0969 1.0920 1.0997 1.2335 1.0870 1.0954 1.7414 1.1011 1.1025 1.0972 1.1862 1.5907 1.1634 5.2953 5.7445 1.0687 1.0871 1.0600 1.0628 1.0690 1.0620 1.0700 1.0887 1.0929 1.1036 1.0950 1.1011 1.0316 1.0325 1.1072 1.1064 1.0861 1.0930 1.1043 1.1066 1.0939 1.0981
irintensity: 2.1000 0.8084 1.8062 1.3090 3.7491 17.4371 1.6759 0.4695 1.0263 3.8615 0.7698 0.8315 6.6828 1.0944 0.1773 0.7598 6.2752 0.5631 12.7520 9.1097 9.5133 2.7106 2.1607 2.6134 5.9399 44.5378 5.3608 18.2219 3.8013 1.4415 8.6266 1.5693 2.0561 3.1774 15.0962 5.9011 0.2537 9.6076 0.5665 4.2379 4.1242 21.9587 17.2335 13.2583 0.2365 3.9902 4.7413 14.0359 7.6911 8.2534 1.7650 0.7142 5.8122 63.0148 6.1002 4.1248 19.2443 77.3683 0.6514 16.3590 41.8044 41.4730 24.4936 0.4744 8.0681 0.1201 12.6685 89.1867 4.8536 2.5614 0.8836 24.6839 6.9285 4.5405 6.6619 7.3680 2.7499 21.7024 7.0099 78.0052 5.7786 13.2264 6.4640 641.9384 1142.9104 67.9602 98.6113 23.9612 42.4536 44.5331 152.5078 121.9919 37.1881 188.2555 136.3661 9.3699 12.3793 6.3270 8.7086 5.1358 1.4636 2.6992 2.4084 31.4504 20.8638
temp: 298.150 k
press: 1.00000 atm
elementType: 1 6 6 6 6 1 6 1 6 1 6 1 1 1 6 1 1 1 7 1 1 5 6 6 6 6 6 1 1 1 1 1 1 1 1 1 1
symmnumber: 1
zpe: 872589.7 jmol-1
zpe.correction: 0.332352 hartree
zpe.thermalcorrener: 0.347046 hartree
zpe.thermalcorrenthalpy: 0.347990 hartree
zpe.thermalcorrgfe: 0.291011 hartree
zpe.sumelectzpe: -587.854447 hartree
zpe.sumelectthermal: -587.839752 hartree
zpe.sumelectthermalent: -587.838808 hartree
zpe.sumelectthermalfe: -587.895787 hartree
dipole: 2.0324 -9.0198 2.9952
dipole: 9.7190
quadrupole: -69.4246 -117.1778 -98.9100
quadrupole: -49.3419 17.3434 2.9571
quadrupole: 25.7462 -22.0070 -3.7392 -49.3419 17.3434 2.9571
hfenergy: -588.1867984 hartree
pointgroup: C01 [X(C13H22B1N1)]
dipole: 0.7995986 -3.5486747 1.1783912 debye
polarizability: 212.3830765|13.929404|226.9536324|8.7983793|-17.9557136|163.8357724 unknown
InChI: InChI=1/C13H22BN/c1-15(2)13-9-5-4-8-12(13)14-10-6-3-7-11-14/h4-5,8-9,14-15H,3,6-7,10-11H2,1-2H3
charge 0 multiplicity 1
37 atoms
H  0.49547403 0.68892442 -0.71391112
C  1.54236021 0.50430244 -0.49673518
C  2.47652445 1.51298348 -0.69011858
C  1.9372127 -0.74666899 -0.02564261
C  3.84433397 1.33471585 -0.42590082
H  2.1403763 2.47696703 -1.05849054
C  3.27727973 -0.97362124 0.24875886
H  1.20991143 -1.53553923 0.12629671
C  4.17627289 0.06450786 0.04245638
H  3.60260925 -1.94092158 0.6181761
C  6.23450768 -1.22871999 -0.44820568
H  6.02307092 -1.05508786 -1.50163779
H  7.31022573 -1.2154791 -0.2741631
H  5.82145185 -2.18782652 -0.13871324
C  5.89523823 -0.24036459 1.78961877
H  5.4623991 -1.16196774 2.17796061
H  6.97480811 -0.24056142 1.93928253
H  5.44773741 0.61878624 2.28494033
N  5.6095839 -0.13850323 0.33790795
H  6.10175725 2.01637459 -0.71967195
H  6.00805417 0.77457301 -0.01772459
B  4.94499109 2.527426 -0.58289532
C  4.71834865 3.46540736 -1.89353473
C  4.99039867 3.45358314 0.76627202
C  5.72372992 4.62392974 -1.9270592
C  5.97633162 4.61848874 0.61098206
C  5.68566052 5.45377943 -0.63988305
H  5.54845641 5.28229827 -2.78796171
H  6.73808514 4.21831492 -2.05000738
H  5.96887656 5.27143645 1.49374614
H  6.99711271 4.21759888 0.53098283
H  6.39930254 6.28370606 -0.70798556
H  4.6892783 5.9069269 -0.53958246
H  5.24252166 2.88085683 1.67195417
H  3.98550732 3.86567777 0.95275453
H  4.78127316 2.89144559 -2.82840249
H  3.70543911 3.89956264 -1.87715721
