program: Gaussian 16
title: QHBcyclo-H2
version: ES64L-G16RevC.01
method: RwB97XD
basis: GenECP
operation: Freq
keyword: #N
keyword: Geom=AllCheck
keyword: Guess=TCheck
keyword: SCRF=Check
keyword: GenChk
keyword: RwB97XD/GenECP
keyword: Freq
converged: YES YES NO YES
title: Mulliken charges:
elementType: C C H C N N N H H H H B C C C C C H H H H H H H H H H H
charge: -0.403048 -0.748886 0.268562 0.213053 0.365939 -0.117520 -0.120723 0.445050 0.226042 0.211062 0.210801 -0.079866 -0.324095 -0.338534 -0.331413 -0.350701 -0.353300 0.147114 0.143148 0.149655 0.140342 0.168166 0.110987 -0.140198 0.134936 0.122430 0.111520 0.139475
chargesum: -0.00000
title: Mulliken charges with hydrogens summed into heavy atoms:
elementType: C C C N N N B C C C C C
charge: 0.244857 -0.480324 0.213053 0.365939 -0.117520 0.324327 -0.220064 -0.073099 -0.081168 -0.041151 -0.060704 -0.074147
1716.lowfreq: -8.4119 0.0006 0.0006 0.0008 7.4139 14.9811 30.0602 67.4098 71.6206
frequency: 28.9882 67.3023 71.3379 84.9095 177.7290 218.6637 224.1655 253.9111 331.1852 371.7862 383.2838 416.7014 428.0594 487.6209 664.0012 685.6430 708.2386 726.8122 731.7680 781.4129 785.2528 829.9509 835.6340 846.7393 872.3914 914.2861 962.4647 963.5586 1033.7109 1036.9571 1050.7112 1062.6667 1082.9388 1093.5960 1097.3826 1121.6504 1138.9470 1151.4050 1158.0981 1172.2963 1238.2139 1241.6284 1258.0282 1290.7173 1306.5581 1314.5361 1326.8005 1363.4023 1377.9585 1381.3467 1404.9966 1453.8708 1456.4465 1461.4295 1464.3340 1485.2847 1486.2102 1487.2308 1488.9243 1500.3619 1520.9363 1600.0987 2282.1884 2959.0351 2963.3448 2997.5457 2999.8055 3003.2249 3019.9248 3022.5785 3038.1294 3042.2143 3055.6352 3088.6864 3178.6811 3202.9490 3305.5917 3654.4099
redmass: 3.6777 3.4445 3.2537 1.0675 2.6414 3.2151 1.7947 5.1199 1.9792 4.0537 2.2340 3.3371 2.6534 1.6928 3.2041 4.2767 4.5455 1.4537 2.6256 1.2271 2.7349 1.3862 2.3395 1.3497 1.7372 2.4316 1.5358 1.9674 1.7424 2.0520 1.3192 2.5383 1.9578 2.7534 1.6975 1.6079 1.2474 1.5154 1.3461 1.7077 1.4918 1.9853 1.6232 1.2306 1.4919 4.4556 1.2659 1.3519 1.5352 1.5133 3.6766 2.3168 1.4424 1.0962 1.0947 1.0938 1.5548 1.0933 1.3786 1.1023 1.4615 3.5075 1.0818 1.0665 1.0657 1.0622 1.0634 1.0698 1.0887 1.0889 1.1040 1.0962 1.1002 1.0324 1.1070 1.1067 1.1010 1.0837
irintensity: 0.0421 1.8183 1.4660 0.1023 2.0332 0.5114 0.3681 5.0916 0.5562 5.5734 1.9170 0.0233 11.6342 1.5578 1.2716 7.5828 3.3013 4.4657 7.8094 86.3381 9.8333 15.0396 1.1578 6.1546 1.1276 1.6084 4.3481 3.7198 2.5588 26.9923 11.5314 6.7334 5.0574 71.3915 2.7962 20.4403 7.9453 19.6712 0.8154 31.0887 33.6444 80.1402 22.6194 0.0107 6.0068 2.7362 1.2053 0.0434 11.4720 0.0072 43.4644 12.9120 4.5359 2.0934 3.1916 6.2718 21.4485 8.8058 20.1956 2.2660 4.5480 50.0514 376.9409 40.2253 117.4206 33.8987 26.3535 68.0772 235.7488 54.0897 30.8180 173.7498 149.2091 12.5546 2.2524 0.1752 5.3564 141.9725
temp: 298.150 k
press: 1.00000 atm
elementType: 6 6 1 6 7 7 7 1 1 1 1 5 6 6 6 6 6 1 1 1 1 1 1 1 1 1 1 1
symmnumber: 1
zpe: 644652.1 jmol-1
zpe.correction: 0.245535 hartree
zpe.thermalcorrener: 0.257195 hartree
zpe.thermalcorrenthalpy: 0.258139 hartree
zpe.thermalcorrgfe: 0.206737 hartree
zpe.sumelectzpe: -503.283862 hartree
zpe.sumelectthermal: -503.272202 hartree
zpe.sumelectthermalent: -503.271258 hartree
zpe.sumelectthermalfe: -503.322660 hartree
dipole: 9.4664 3.5072 -1.4039
dipole: 10.1923
quadrupole: -106.0107 -89.7158 -79.4347
quadrupole: -24.3119 13.4811 1.9420
quadrupole: -14.2903 2.0046 12.2857 -24.3119 13.4811 1.9420
hfenergy: -503.529397 hartree
pointgroup: C01 [X(C8H16B1N3)]
dipole: 3.7243623 1.3798357 -0.5523391 debye
polarizability: 170.7759139|17.4356417|142.9085294|-8.4624594|-14.8322096|134.1635259 unknown
InChI: InChI=1/C8H16BN3/c1-12-7-8(10-11-12)9-5-3-2-4-6-9/h7,9-10H,2-6H2,1H3
charge 0 multiplicity 1
28 atoms
C  1.54986488 -0.53761669 0.36565408
C  -0.72041226 -1.54184112 0.82611962
H  -0.35429449 -2.26413233 1.53535235
C  -2.00015927 -1.29730796 0.35797279
N  0.10636271 -0.65973176 0.21349393
N  -0.52702329 0.12973379 -0.60900802
N  -1.77557532 -0.27198943 -0.50288092
H  -2.48501341 0.19264474 -1.05315828
H  2.03232302 -1.41870162 -0.05553647
H  1.86844637 0.35481363 -0.16671805
H  1.78770249 -0.44851132 1.42424641
B  -3.45367379 -1.92748483 0.6550844
C  -3.43284535 -3.54663864 0.43309163
C  -3.90147264 -1.59112846 2.19323936
C  -4.76843761 -4.16817775 0.86130438
C  -5.21584396 -2.3020808 2.5401734
C  -5.13057665 -3.81366794 2.30688935
H  -4.7577324 -5.26007842 0.74672496
H  -5.56392058 -3.79480921 0.20164052
H  -5.51184738 -2.11122558 3.5801298
H  -6.01944059 -1.89711814 1.90960889
H  -6.08069356 -4.2878244 2.58077473
H  -4.36780716 -4.23433252 2.97801434
H  -4.22622855 -1.38524551 -0.14648516
H  -4.00982672 -0.51156644 2.36887976
H  -3.1276441 -1.93562491 2.9005673
H  -2.63215049 -4.00705201 1.03754423
H  -3.21734755 -3.82059096 -0.60914696
