program: Gaussian 16
title: MeQHBCCH-H2
version: ES64L-G16RevC.01
method: RwB97XD
basis: GenECP
operation: Freq
keyword: #N
keyword: Geom=AllCheck
keyword: Guess=TCheck
keyword: SCRF=Check
keyword: GenChk
keyword: RwB97XD/GenECP
keyword: Freq
converged: YES YES YES YES
title: Mulliken charges:
elementType: C C H C N N N B H H H H H C C H C C H
charge: -0.406759 -0.567431 0.283275 -0.119789 0.269195 -0.031090 -0.147099 0.038824 0.404318 0.221617 0.217900 0.222239 0.040218 -0.194622 -0.298035 0.264700 -0.139986 -0.328134 0.270659
chargesum: -0.00000
title: Mulliken charges with hydrogens summed into heavy atoms:
elementType: C C C N N N B C C C C
charge: 0.254997 -0.284155 -0.119789 0.269195 -0.031090 0.257219 0.079042 -0.194622 -0.033335 -0.139986 -0.057474
1716.lowfreq: -13.1537 0.0005 0.0005 0.0006 7.3770 17.1952 37.8701 52.6606 78.9505
frequency: 37.3212 52.5993 78.8460 95.2986 110.8344 193.0317 238.8925 311.2945 318.7218 379.3903 402.2125 470.8013 492.5378 621.1582 679.0428 681.3604 690.7306 706.1570 713.6207 720.4425 752.3583 810.5614 817.1803 844.0572 884.8880 1025.0508 1080.9657 1085.9136 1094.7545 1095.1333 1159.7820 1178.2823 1245.9654 1327.4846 1412.1092 1452.4775 1458.3569 1486.9543 1489.5863 1520.9029 1615.6432 2159.4951 2165.9576 2425.2486 3089.8651 3180.6876 3204.5082 3304.2576 3461.5320 3464.9480 3599.8824
redmass: 3.8311 1.0947 4.4003 4.2335 4.1046 3.6107 4.3157 4.5926 3.9021 4.3380 4.4758 4.6927 6.3128 3.9182 1.3004 1.3117 6.1192 1.3233 1.7508 2.5352 3.3743 2.3869 1.3715 1.5635 2.0072 1.8955 1.8234 2.6535 2.1966 2.5374 1.3393 1.7180 1.9708 6.2426 3.5117 1.7577 1.8569 1.0416 2.5058 1.4971 3.8322 5.8763 5.8781 1.0850 1.0322 1.1074 1.1066 1.1026 1.1598 1.1602 1.0846
irintensity: 0.2283 0.0134 1.1777 1.2339 1.1485 2.7371 1.5960 11.7163 0.8512 19.8863 14.8801 0.2081 16.9164 1.0127 32.3578 100.2550 6.7980 58.3425 40.9096 33.7944 34.9298 13.6366 70.3053 29.1329 3.9356 65.1173 12.7949 65.5548 61.8285 90.9952 0.0425 81.5280 79.8949 0.8879 22.8677 9.7840 14.0179 19.4938 34.5437 7.4291 40.0936 6.2449 6.2457 172.1312 10.4318 1.5808 0.0246 7.2500 71.4142 59.3483 213.6314
temp: 298.150 k
press: 1.00000 atm
elementType: 6 6 1 6 7 7 7 5 1 1 1 1 1 6 6 1 6 6 1
symmnumber: 1
zpe: 376160.3 jmol-1
zpe.correction: 0.143272 hartree
zpe.thermalcorrener: 0.154452 hartree
zpe.thermalcorrenthalpy: 0.155396 hartree
zpe.thermalcorrgfe: 0.105017 hartree
zpe.sumelectzpe: -460.329496 hartree
zpe.sumelectthermal: -460.318315 hartree
zpe.sumelectthermalent: -460.317371 hartree
zpe.sumelectthermalfe: -460.367750 hartree
dipole: 8.3109 5.5713 -3.5144
dipole: 10.6048
quadrupole: -88.3781 -76.4563 -69.0206
quadrupole: -14.8512 14.9775 14.9323
quadrupole: -10.4264 1.4954 8.9310 -14.8512 14.9775 14.9323
hfenergy: -460.4727674 hartree
pointgroup: C01 [X(C7H8B1N3)]
dipole: 3.2697716 2.1919242 -1.3826658 debye
dipolederiv: 0.4316897 0.228399 0.0088214 0.216079 0.366211 -0.0308061 0.0121043 -0.0237927 0.1376441 -0.2342751 0.048038 0.2834188 -0.1758545 -0.0352305 0.2509343 -0.0558976 -0.0125754 -0.0304055 0.1392605 -0.0400123 0.0008333 -0.0325871 0.1445104 -0.0402719 0.0045723 -0.0418615 0.1363978 0.3200521 0.056327 -0.2698013 0.264207 0.0059573 -0.3238634 0.026526 -0.0566192 -0.2205821 -0.1241214 -0.2283287 -0.2082063 -0.2976812 -0.2588399 0.0947839 -0.3158186 -0.013737 0.3160133 -0.2294728 0.1242727 0.4378829 0.1838527 0.0964643 0.0124807 0.4619365 0.0945751 -0.5434894 -0.1652415 -0.2847595 -0.2836069 -0.2246186 -0.3557725 -0.0393053 -0.2151498 -0.0301064 0.1457612 0.516714 0.1311321 0.0341203 0.186483 0.6820838 0.0370509 0.0047942 0.0379923 0.8380873 0.3638117 0.1045047 0.0077619 0.1107793 0.4038012 0.0072473 0.0218314 0.0233679 0.3135611 0.023023 -0.0602694 -0.0174976 -0.0235423 0.0518753 0.0632017 -0.0719548 0.0247564 0.0122942 0.0661601 -0.047594 0.0057638 -0.0028274 0.074162 -0.0614467 0.0650141 -0.0120681 0.0320454 -0.0042253 0.0428227 0.0052454 -0.0277687 -0.0317278 0.0050781 0.004845 -0.0017442 0.1180316 -0.3178379 0.0822233 -0.0212907 0.0680218 -0.3226817 0.0332647 -0.007984 0.0272459 -0.2281348 -0.2813472 -0.0865193 0.068681 -0.1018424 -0.3135039 -0.0310602 0.0665715 -0.0695241 0.082134 -0.3666103 0.0103632 -0.0767038 0.0015769 -0.3568229 0.0458273 0.0041037 0.0312033 -0.8139655 0.2693321 0.0002651 -0.0053402 0.0040751 0.2689491 0.0191394 -0.0175034 0.0127576 0.1872592 -0.2832555 -0.0222734 0.0627185 -0.0419466 -0.0538856 0.2156401 0.0758095 0.2441193 -0.180694 -0.3878651 -0.0324042 -0.0171219 -0.0977348 -0.5842992 -0.2147328 -0.0645893 -0.2107406 -0.5564699 0.2642089 -0.0261868 -0.0156786 -0.0086712 0.2187495 -0.0431619 0.000789 -0.0232484 0.2545116 unknown
polarizability: 117.4223365|24.8317885|121.2262326|-6.8400257|11.9904645|142.1976798 unknown
InChI: InChI=1/C7H8BN3/c1-4-8(5-2)7-6-11(3)10-9-7/h1-2,6,8-9H,3H3
charge 0 multiplicity 1
19 atoms
C  1.4038059 0.45354072 0.015683
C  -0.66978748 -0.57023235 1.0304077
H  -0.66410583 0.05175443 1.9086397
C  -1.5290622 -1.57616325 0.64142594
N  0.27294355 -0.46492359 0.06252938
N  0.08972117 -1.31849311 -0.90741916
N  -0.98920648 -1.9673971 -0.53692866
B  -2.87302137 -2.22837442 1.26921199
H  -1.34719401 -2.7205744 -1.11525331
H  2.03581023 0.28461082 0.88609219
H  1.95903164 0.25087522 -0.89637243
H  1.0329534 1.47730253 0.0109419
H  -3.76109573 -1.40851582 1.12157227
C  -2.64701242 -2.50565791 2.80943125
C  -2.46394493 -2.68784237 3.9903153
H  -2.31879091 -2.86203144 5.03085494
C  -3.20551511 -3.52835991 0.42435882
C  -3.4148546 -4.48804148 -0.28194205
H  -3.63396602 -5.3470268 -0.87273626
