program: Gaussian 16
title: f_benzopiperidine_h2_2
version: ES64L-G16RevC.02
method: RwB97XD
basis: GenECP
operation: Freq
keyword: #N
keyword: Geom=AllCheck
keyword: Guess=TCheck
keyword: SCRF=Check
keyword: GenChk
keyword: RwB97XD/GenECP
keyword: Freq
converged: YES YES NO YES
title: Mulliken charges:
elementType: H C C C C H C H H B H H C N C C C H H C H H C H H H H H H F F
charge: 0.221395 -0.353550 -0.319842 -0.510784 -0.097436 0.246716 -0.064233 0.238727 0.213421 0.351106 -0.081754 0.282673 0.021744 0.141592 -0.309406 -0.241136 -0.393737 0.277508 0.210302 -0.431348 0.287705 0.198344 -0.474183 0.238184 0.208883 0.228859 0.223494 0.236523 0.156939 -0.345328 -0.361376
chargesum: -0.00000
title: Mulliken charges with hydrogens summed into heavy atoms:
elementType: C C C C C B C N C C C C C F F
charge: -0.132156 -0.073126 -0.272058 -0.097436 0.149188 0.269353 0.021744 0.424265 0.178403 0.244913 0.053331 0.021005 -0.080722 -0.345328 -0.361376
1716.lowfreq: -0.0005 0.0007 0.0007 12.7153 24.6999 37.0265 51.1687 109.3041 136.7634
frequency: 43.1589 106.5594 130.5330 143.3473 178.7903 226.2854 246.3456 278.2325 333.3314 354.9755 373.0836 414.6811 446.8099 479.7878 510.3710 564.4199 581.0974 589.3690 621.0885 662.0773 762.4284 766.2968 787.1284 791.9221 807.9596 829.3825 860.3055 873.0019 897.2122 906.3013 907.9973 930.5142 937.1353 983.4972 1012.6875 1025.4558 1043.3805 1064.5129 1070.4143 1080.0160 1088.1130 1096.5514 1119.6281 1126.2469 1188.7308 1194.9597 1222.8970 1235.1320 1249.3824 1270.2698 1298.3040 1315.0713 1331.9889 1362.2086 1376.7972 1393.1217 1410.4080 1433.1529 1435.4838 1449.6192 1482.0262 1492.2728 1499.9343 1511.4724 1556.2645 1647.3139 1680.9840 1686.0793 1819.4591 1867.5617 1952.4586 2469.1480 3057.2110 3058.6856 3079.8777 3108.8259 3116.1477 3120.5092 3141.4972 3152.4919 3181.6143 3191.0504 3199.5577 3214.9044 3226.5366 3278.9952 4002.2899
redmass: 10.5038 4.9677 4.8144 5.1109 2.9686 4.4850 6.6337 5.1556 4.8284 3.8506 3.8507 1.7504 2.4647 8.3655 3.7316 3.7534 4.7864 3.1283 5.6140 5.4814 2.4133 2.5747 1.9892 2.9942 4.5497 2.6588 2.8354 1.5487 1.8526 2.7233 1.4690 2.1089 2.2490 1.3737 1.4590 1.3234 2.3981 2.0491 1.8197 1.5814 1.4718 1.7139 1.9461 2.0044 1.1440 1.9112 2.9908 1.3145 1.7025 1.7382 1.4034 1.6862 2.9791 1.3573 1.4180 1.5615 1.3331 1.2965 1.2027 1.1848 1.7284 1.1929 1.1562 1.9746 1.4530 5.4055 1.0596 5.1161 1.0526 1.0391 1.0537 1.0861 1.0660 1.0658 1.0633 1.0825 1.1001 1.0947 1.0818 1.0992 1.0871 1.0890 1.0939 1.0984 1.0832 1.0787 1.0358
irintensity: 1.9546 1.3687 4.7370 9.1131 5.1117 11.2571 14.2371 5.5703 6.7460 1.9691 2.0673 0.4602 1.6880 0.5813 8.7482 6.3806 9.3073 3.2840 28.5058 1.2536 48.3732 67.3118 23.3843 24.2800 120.3196 3.5929 2.6290 0.1736 49.8374 73.6213 21.4270 7.0008 9.8415 0.2093 7.6871 0.1718 16.8574 43.7779 11.4006 75.8874 27.3926 29.4375 81.8296 5.0150 1.6470 128.9073 9.5776 14.8533 23.3014 1.1909 11.6903 11.3952 1.8098 0.5826 0.2559 2.4780 2.8019 75.8792 8.5353 9.2469 38.3854 3.3050 8.5498 12.3982 54.7783 22.7309 7.0431 15.2916 4.9928 11.4994 9.0117 413.9045 11.5156 11.0996 33.7838 46.6988 20.7510 30.4360 5.5468 16.2016 5.1809 1.9976 30.3378 16.5124 6.8425 376.6522 40.0661
temp: 298.150 k
press: 1.00000 atm
elementType: 1 6 6 6 6 1 6 1 1 5 1 1 6 7 6 6 6 1 1 6 1 1 6 1 1 1 1 1 1 9 9
symmnumber: 1
zpe: 717849.9 jmol-1
zpe.correction: 0.273415 hartree
zpe.thermalcorrener: 0.285484 hartree
zpe.thermalcorrenthalpy: 0.286428 hartree
zpe.thermalcorrgfe: 0.235145 hartree
zpe.sumelectzpe: -707.913468 hartree
zpe.sumelectthermal: -707.901399 hartree
zpe.sumelectthermalent: -707.900455 hartree
zpe.sumelectthermalfe: -707.951737 hartree
dipole: 5.9497 -7.2989 -3.7668
dipole: 10.1421
quadrupole: -74.5791 -97.6505 -94.5116
quadrupole: 4.0996 0.8043 -4.4201
quadrupole: 14.3347 -8.7368 -5.5979 4.0996 0.8043 -4.4201
hfenergy: -708.1868824 hartree
pointgroup: C01 [X(C11H16B1F2N1)]
dipole: 2.340807 -2.8715967 -1.481981 debye
polarizability: 196.3638938|6.5882127|163.5669492|-5.3972878|13.7996633|129.5194945 unknown
InChI: InChI=1/C11H16BF2N/c13-12(14)10-6-2-3-7-11(10)15-8-4-1-5-9-15/h2-3,6-7,12,15H,1,4-5,8-9H2
charge 0 multiplicity 1
31 atoms
H  -4.26636949 -1.80208723 -0.01641505
C  -3.23346452 -1.47247126 -0.04156543
C  -2.90392075 -0.18257693 0.35997798
C  -2.24026644 -2.34680935 -0.47058488
C  -1.58541051 0.28000633 0.35482624
H  -3.68654749 0.49011203 0.69659554
C  -0.91798351 -1.92264094 -0.50009381
H  -2.4893433 -3.3556977 -0.77805044
H  -0.13867152 -2.60211449 -0.82782668
B  -1.16869685 1.75401197 0.91553206
H  -2.10527277 2.51199192 1.05696599
H  0.72472506 0.82997203 0.16840427
C  -0.63014858 -0.62837977 -0.09206655
N  0.77848707 -0.17416901 -0.07356146
C  1.57896204 -0.87318644 0.98446931
C  1.44788327 -0.21047557 -1.41392533
C  2.962264 -0.2542542 1.09423604
H  1.00990327 -0.78004015 1.90844127
H  1.62738482 -1.92768035 0.69325524
C  2.8452942 0.38573952 -1.32697291
H  0.80427378 0.34561048 -2.0949582
H  1.4814967 -1.25017866 -1.73475429
C  3.68865784 -0.29647356 -0.24857147
H  3.51974687 -0.79492622 1.86193874
H  2.86425842 0.78036883 1.44096733
H  3.31245468 0.29298235 -2.30992554
H  2.76403736 1.45692381 -1.1127753
H  4.66006783 0.1958041 -0.16987924
H  3.88068003 -1.34223216 -0.52175454
F  -0.17868147 2.32521078 -0.02272886
F  -0.42885404 1.56315083 2.14069998
