program: Gaussian 16
title: f_biphenylene_h2
version: ES64L-G16RevC.02
method: RwB97XD
basis: GenECP
operation: Freq
keyword: #N
keyword: Geom=AllCheck
keyword: Guess=TCheck
keyword: SCRF=Check
keyword: GenChk
keyword: RwB97XD/GenECP
keyword: Freq
converged: YES YES YES YES
title: Mulliken charges:
elementType: C C C C C C C H C H H C H C H C C H B N C H H H C H H H F F H H
charge: 0.557981 -0.131498 -0.104763 0.311325 -0.397041 -0.300880 -0.178874 0.213789 -0.497700 0.249555 0.183043 -0.536572 0.206275 -0.259793 0.226770 -0.041485 -0.409995 0.246004 0.057562 0.016254 -0.359893 0.201800 0.225414 0.252880 -0.402369 0.227931 0.229552 0.228614 -0.292453 -0.270903 0.561368 -0.011898
chargesum: -0.00000
title: Mulliken charges with hydrogens summed into heavy atoms:
elementType: C C C C C C C C C C C C B N C C F F
charge: 0.557981 -0.131498 -0.104763 0.311325 -0.183253 -0.300880 0.070680 -0.314657 -0.330297 -0.033023 0.204519 -0.409995 0.045664 0.577622 0.320201 0.283728 -0.292453 -0.270903
1716.lowfreq: -5.3380 -0.0010 -0.0007 -0.0003 7.9601 9.5702 39.7155 49.1474 91.6829
frequency: 39.5151 48.9522 91.6674 102.5973 132.5869 150.8633 168.0786 176.0017 217.9102 259.5161 264.7054 283.5261 293.8217 314.2372 352.3506 360.8128 427.3133 448.6951 463.3749 478.2549 486.0970 555.1617 595.0775 611.9518 623.2762 658.1437 686.6180 735.6203 745.3947 752.7063 776.5377 789.9218 803.5054 829.7535 892.4103 928.0849 941.5968 960.1056 974.8385 995.8074 1005.1637 1010.9034 1039.8860 1048.1742 1062.0263 1091.1943 1094.7588 1111.0053 1153.0574 1156.9415 1177.9939 1188.6847 1200.3820 1209.8376 1221.8049 1249.5478 1268.2111 1296.9964 1317.7057 1409.3088 1435.7428 1451.9213 1481.2510 1483.8743 1488.5616 1497.7104 1501.6937 1511.1730 1517.1395 1527.5562 1549.1320 1579.1665 1654.8256 1671.6964 1696.3242 1750.1700 2376.4417 2932.8580 3081.3539 3088.2352 3179.3160 3181.7635 3185.0856 3190.9575 3194.6482 3195.7339 3198.6341 3211.5656 3212.9695 3221.7067
redmass: 6.3199 4.0398 4.1337 4.1964 3.9944 4.1115 7.5324 4.2635 1.1204 5.0638 1.2196 3.7843 3.1980 4.0763 4.4136 4.6621 5.1508 8.2236 4.4044 4.6647 3.5869 3.4523 5.5248 5.5144 4.4444 4.7673 4.4208 4.0823 6.1468 3.4679 1.8035 2.2249 2.7174 3.3484 4.4763 1.3554 1.4097 3.5983 2.9967 1.3106 6.4636 1.3327 1.9798 2.2980 1.9238 1.2990 1.2413 1.7582 2.0330 2.6806 1.5480 1.7734 1.9596 1.8675 2.2379 2.0597 1.7637 2.1742 2.7851 2.3209 2.4256 1.1474 1.1865 1.0736 1.0663 1.4855 2.2421 1.1384 1.4372 4.2111 1.1699 1.2465 8.5261 6.9827 6.4357 8.5450 1.0797 1.0895 1.0312 1.0323 1.0867 1.1084 1.1065 1.1077 1.1062 1.0930 1.0897 1.0933 1.0960 1.0970
irintensity: 1.7466 5.2333 2.2844 6.7853 0.8312 6.7222 22.9364 5.2953 0.9480 13.7131 2.4679 1.2199 0.9430 0.5866 8.2681 2.3425 1.0273 15.9801 0.0838 15.0616 3.8866 4.1996 5.7162 8.5455 17.3439 8.6362 11.8055 23.5124 8.9887 205.1360 11.3674 67.8495 27.8955 8.4862 8.3911 4.9367 2.9893 33.4635 109.1550 0.5366 15.4183 0.7714 15.7902 2.7535 24.6351 65.5477 23.4231 201.9404 38.3758 125.2726 38.2172 5.2325 4.0516 61.0085 40.0259 22.8321 5.9528 12.0342 17.4449 1.9342 51.8128 3.8160 2.1380 0.4381 7.1961 10.3828 1.0933 18.0015 28.1079 9.3003 21.7254 36.4255 2.5965 5.2935 12.5154 10.4778 369.1882 1040.6153 5.7959 7.5877 2.2524 0.5284 4.7026 2.0169 2.3106 25.7523 2.0859 4.4875 28.9367 10.6686
temp: 298.150 k
press: 1.00000 atm
elementType: 6 6 6 6 6 6 6 1 6 1 1 6 1 6 1 6 6 1 5 7 6 1 1 1 6 1 1 1 9 9 1 1
symmnumber: 1
zpe: 669790.2 jmol-1
zpe.correction: 0.255110 hartree
zpe.thermalcorrener: 0.270631 hartree
zpe.thermalcorrenthalpy: 0.271576 hartree
zpe.thermalcorrgfe: 0.212330 hartree
zpe.sumelectzpe: -820.938904 hartree
zpe.sumelectthermal: -820.923382 hartree
zpe.sumelectthermalent: -820.922438 hartree
zpe.sumelectthermalfe: -820.981683 hartree
dipole: -12.1302 2.3126 0.0218
dipole: 12.3487
quadrupole: -94.4740 -100.7393 -107.1344
quadrupole: 26.0722 -2.7048 0.7682
quadrupole: 6.3086 0.0433 -6.3519 26.0722 -2.7048 0.7682
hfenergy: -821.1940133 hartree
pointgroup: C01 [X(C14H14B1F2N1)]
dipole: -4.7723939 0.9098375 0.0085836 debye
polarizability: 298.8859937|2.9417292|230.5019242|-16.1087607|4.7498707|126.660394 unknown
InChI: InChI=1/C14H14BF2N/c1-18(2)12-8-4-6-10-9-5-3-7-11(15(16)17)13(9)14(10)12/h3-8,15,18H,1-2H3
charge 0 multiplicity 1
32 atoms
C  0.89487455 0.59216527 -0.07371274
C  0.94581581 2.00361131 -0.04483387
C  -0.5584557 2.0632015 0.09050291
C  -0.59695989 0.6445858 0.07059952
C  -1.69018583 2.81739074 0.1961731
C  -1.77133433 -0.02998573 0.16828955
C  -2.91436216 2.10156185 0.28457623
H  -1.68411357 3.9002344 0.21214489
C  -2.96491596 0.72356587 0.27121491
H  -3.84256354 2.65479125 0.36675677
H  -3.92582798 0.22685583 0.34078847
C  2.130938 2.67943 -0.14426828
H  2.21495886 3.75940891 -0.12732407
C  3.27366111 1.85554138 -0.27483771
H  4.24844353 2.32572511 -0.35251692
C  3.19451333 0.46976076 -0.30797118
C  1.9714196 -0.24705887 -0.2112519
H  4.11465193 -0.09721561 -0.40886072
B  1.83987822 -1.85176099 -0.32620185
N  -1.77274784 -1.49743863 0.13907328
C  -2.53961672 -2.11139135 1.2566659
H  -3.6022586 -1.91292829 1.12683979
H  -2.35741301 -3.18468962 1.24402425
H  -2.18581146 -1.68391168 2.19241959
C  -2.19169113 -2.02923466 -1.1882312
H  -2.0926349 -3.11364473 -1.17309232
H  -3.22546426 -1.74228079 -1.37740526
H  -1.53682388 -1.60630992 -1.94741565
F  0.68660617 -2.27082798 0.55901061
F  2.98551794 -2.51729808 0.16375972
H  -0.77114673 -1.79240621 0.27948174
H  1.54949363 -2.22072836 -1.45786718
