program: Gaussian 16
title: MeQClBF2-H2
version: ES64L-G16RevC.01
method: RwB97XD
basis: GenECP
operation: Freq
keyword: #N
keyword: Geom=AllCheck
keyword: Guess=TCheck
keyword: SCRF=Check
keyword: GenChk
keyword: RwB97XD/GenECPFreq
converged: YES YES NO YES
title: Mulliken charges:
elementType: C C C N N N B H H H H H Cl F F
charge: -0.418689 0.002006 -0.834415 0.301014 -0.020353 -0.127158 0.207418 0.457004 0.233683 0.211734 0.236230 -0.120252 0.393277 -0.264229 -0.257270
chargesum: -0.00000
title: Mulliken charges with hydrogens summed into heavy atoms:
elementType: C C C N N N B Cl F F
charge: 0.262957 0.002006 -0.834415 0.301014 -0.020353 0.329846 0.087166 0.393277 -0.264229 -0.257270
1716.lowfreq: -12.3960 0.0005 0.0025 0.0027 3.2547 12.3579 27.9266 83.2258 101.5348
frequency: 25.8690 83.2046 101.4945 109.6752 191.9340 233.2546 278.3586 282.9005 403.3269 438.4389 478.2544 538.0118 649.7288 690.1185 724.5119 778.7692 802.0826 943.3499 947.0437 1066.4460 1087.8839 1117.9474 1128.2328 1158.9249 1191.9863 1251.0879 1324.9348 1409.2082 1443.0602 1477.1966 1482.2110 1485.6212 1521.9855 1600.3490 2379.9732 3090.4492 3181.2212 3209.2440 3635.2844
redmass: 11.2470 5.7819 12.6875 1.0625 5.8158 4.2960 5.3160 12.3542 9.3126 4.5740 7.8853 10.2823 4.7298 10.0554 7.6730 5.6881 1.1671 3.4097 5.8808 3.4630 1.8565 1.4314 1.6021 1.3349 5.5906 2.1556 8.3285 3.2271 2.0558 2.0766 1.0384 1.8133 1.8149 3.9280 1.0788 1.0321 1.1075 1.1066 1.0841
irintensity: 0.0046 0.0439 6.2589 0.2637 0.1344 1.0115 4.5764 15.4562 3.9366 20.4164 0.1007 3.1297 33.0057 0.1107 0.3055 85.5199 99.7117 146.3122 118.4896 1.4097 89.3206 199.9076 179.0877 0.0037 116.9075 107.9445 20.9673 30.3926 4.0725 40.3299 22.4916 10.7390 45.3688 35.6080 409.4271 4.3572 0.6483 0.0549 194.4041
temp: 298.150 k
press: 1.00000 atm
elementType: 6 6 6 7 7 7 5 1 1 1 1 1 17 9 9
symmnumber: 1
zpe: 262840.9 jmol-1
zpe.correction: 0.100111 hartree
zpe.thermalcorrener: 0.109843 hartree
zpe.thermalcorrenthalpy: 0.110787 hartree
zpe.thermalcorrgfe: 0.063074 hartree
zpe.sumelectzpe: -966.275246 hartree
zpe.sumelectthermal: -966.265513 hartree
zpe.sumelectthermalent: -966.264569 hartree
zpe.sumelectthermalfe: -966.312283 hartree
dipole: 7.9881 7.1735 -4.5084
dipole: 11.6445
quadrupole: -76.2362 -90.2231 -71.7037
quadrupole: -24.1978 16.7605 10.5774
quadrupole: 3.1514 -10.8354 7.6840 -24.1978 16.7605 10.5774
hfenergy: -966.3753565 hartree
pointgroup: C01 [X(C3H5B1Cl1F2N3)]
dipole: 3.1427521 2.8222898 -1.773729 debye
dipolederiv: 0.4974653 0.1627237 -0.0609466 0.1036606 0.1940071 0.0061916 -0.012528 0.0206739 0.1516675 0.3989146 -0.6231319 0.6559378 -0.2674565 0.273781 -0.3002581 0.3397001 -0.39082 0.4542572 -0.275867 0.1578831 -0.2119975 -0.0553777 -0.1777029 0.1448467 -0.0365955 0.1909986 -0.1842672 -0.4662211 -0.1079859 -0.0221252 0.014853 0.1903757 -0.1707605 -0.1279214 -0.2024695 0.1428552 0.170183 -0.0009885 0.0639149 -0.0626903 -0.5364485 0.4042941 0.1172674 0.4180942 -0.4127053 -0.4753668 0.0810257 -0.1661526 0.032086 0.1830933 -0.2587451 -0.1217384 -0.2418805 0.0748111 1.571904 0.0919326 -0.0946648 0.2422392 1.6248921 0.0144613 -0.2353394 -0.026816 1.5265368 0.4000485 -0.0272741 0.0474909 -0.0419991 0.2959741 0.0031882 0.0600976 0.0076172 0.3188311 0.0110421 -0.0330229 0.0110488 0.0351364 -0.0021504 -0.0459611 0.0130015 -0.0311902 0.1153808 0.0616234 0.0272621 -0.0429596 -0.0303005 0.0667994 0.0502273 0.0097274 0.0651037 0.072207 0.0184899 -0.0305617 0.0414151 -0.029369 0.1099499 -0.0158551 -0.0189162 -0.0477986 -0.0062298 -0.5141234 0.0257895 -0.1200325 0.0200997 -0.2609493 0.0693968 -0.1109074 0.0710974 -0.2944473 -0.181379 0.2098495 -0.2455175 0.1644529 -0.147625 0.2198769 -0.2071677 0.2312755 -0.2123828 -0.6008403 0.1239524 0.0504639 -0.0551726 -1.2906554 -0.0841205 0.0492844 -0.0368402 -0.4944248 -0.615873 -0.0574536 0.0941249 -0.0701621 -0.5233411 -0.0367825 0.2820357 -0.0270456 -1.2520894 unknown
polarizability: 103.8808558|3.733906|85.6045796|7.6571343|-21.1199943|81.9443411 unknown
InChI: InChI=1/C3H5BClF2N3/c1-10-3(5)2(4(6)7)8-9-10/h4,8H,1H3
charge 0 multiplicity 1
15 atoms
C  1.59394765 0.03374592 -0.04712758
C  -0.30485807 -1.42911714 0.77526258
C  -1.65384182 -1.5059797 0.49868946
N  0.21348343 -0.42995062 0.01253902
N  -0.70357062 0.13458353 -0.7284318
N  -1.79383145 -0.52329138 -0.41807505
B  -2.91990236 -2.43120792 1.01112121
H  -2.66065359 -0.26538123 -0.87311101
H  2.23410025 -0.79091849 -0.3567155
H  1.63456053 0.84042271 -0.77386346
H  1.89256671 0.39220004 0.93687152
H  -3.91271203 -2.08754212 0.38001975
Cl 0.65221839 -2.34234118 1.83791331
F  -2.58198886 -3.78872544 0.77194067
F  -3.07417643 -2.20483819 2.40417764
