program: Gaussian 16
title: MeQCNBF2-H2
version: ES64L-G16RevC.01
method: RwB97XD
basis: GenECP
operation: Freq
keyword: #N
keyword: Geom=AllCheck
keyword: Guess=TCheck
keyword: SCRF=Check
keyword: GenChk
keyword: RwB97XD/GenECP
keyword: Freq
converged: YES YES NO NO
title: Mulliken charges:
elementType: C C C N N N B H H H H H F F C N
charge: -0.410388 0.907620 -0.598098 0.215700 0.099842 -0.230074 0.252697 0.456890 0.249095 0.229493 0.234848 -0.030472 -0.296868 -0.228080 -0.658908 -0.193295
chargesum: -0.00000
title: Mulliken charges with hydrogens summed into heavy atoms:
elementType: C C C N N N B F F C N
charge: 0.303047 0.907620 -0.598098 0.215700 0.099842 0.226816 0.222225 -0.296868 -0.228080 -0.658908 -0.193295
1716.lowfreq: -14.1763 -11.5909 -0.0014 -0.0008 -0.0006 11.9252 40.9018 80.9709 93.1983
frequency: 40.3486 80.6662 93.0062 99.3835 149.8928 167.3582 240.4906 294.3262 347.7702 400.9593 468.4492 502.5404 564.5255 608.0945 650.0459 696.3071 759.6396 777.6567 817.2217 903.8939 963.2364 1058.9107 1095.0190 1112.3357 1122.4821 1157.8639 1222.9995 1255.0780 1319.5015 1426.8953 1441.6289 1475.2406 1483.3416 1504.6447 1516.2851 1611.8085 2404.3039 2460.9158 3091.5647 3184.1169 3212.0276 3617.9227
redmass: 10.9019 3.6272 1.3113 4.5889 6.1622 8.1099 5.4823 6.3290 5.8549 6.0437 10.4532 7.8909 7.2529 6.2100 6.1310 10.1723 6.6358 5.1107 1.2023 5.3576 3.7735 2.5155 1.7311 1.7272 1.6183 1.3378 1.8141 7.6170 8.4676 2.9647 2.1315 1.6628 1.0455 2.3871 1.7945 5.8230 12.6511 1.0814 1.0319 1.1077 1.1072 1.0847
irintensity: 1.0441 2.0278 1.1652 6.7033 0.7263 4.3824 6.4605 9.6532 9.4480 8.2084 0.2953 4.4567 3.9570 7.8792 12.6826 0.9358 12.2624 46.5556 97.7629 153.6128 137.8370 42.1840 68.6415 187.5092 207.7664 0.1480 87.8298 7.3240 10.0434 46.6783 16.5031 29.7757 23.2941 2.3094 3.6198 3.2226 21.7577 281.9975 2.2649 0.1451 0.3093 258.6696
temp: 298.150 k
press: 1.00000 atm
elementType: 6 6 6 7 7 7 5 1 1 1 1 1 9 9 6 7
symmnumber: 1
zpe: 283519.1 jmol-1
zpe.correction: 0.107987 hartree
zpe.thermalcorrener: 0.118385 hartree
zpe.thermalcorrenthalpy: 0.119329 hartree
zpe.thermalcorrgfe: 0.070607 hartree
zpe.sumelectzpe: -598.891547 hartree
zpe.sumelectthermal: -598.881150 hartree
zpe.sumelectthermalent: -598.880205 hartree
zpe.sumelectthermalfe: -598.928927 hartree
dipole: 7.1565 7.5839 -5.3564
dipole: 11.7227
quadrupole: -81.3814 -89.8864 -74.0527
quadrupole: -19.5040 5.0740 14.2662
quadrupole: 0.3921 -8.1129 7.7208 -19.5040 5.0740 14.2662
hfenergy: -598.999534 hartree
pointgroup: C01 [X(C4H5B1F2N4)]
dipole: 2.8155678 2.9837477 -2.1073505 debye
dipolederiv: 0.4716532 0.1534763 -0.0610895 0.1327572 0.214108 0.0029175 0.0013907 0.0255114 0.1249222 0.0435738 -0.1362847 0.1917004 0.056505 0.07571 0.1205766 -0.1460648 -0.0122909 0.0476383 0.0292854 0.0376456 -0.1223268 0.0327375 -0.0041838 -0.0254918 0.1450725 0.1374911 -0.1207451 -0.3950426 -0.136238 -0.0419403 -0.1239587 0.1073424 -0.2737013 -0.0955309 -0.2957141 0.4357064 0.1660851 0.0716563 0.0317431 0.0180231 -0.2448228 0.3404591 0.0983949 0.3542953 -0.5994967 -0.4501554 -0.0416461 -0.1580796 -0.098058 -0.0465372 -0.1508642 -0.0800476 -0.128621 0.0513637 1.6082425 0.0705027 0.1512015 0.2236932 1.585483 -0.0634128 0.1039591 -0.0676106 1.2399708 0.4498184 0.0000951 0.0967268 0.0016012 0.3111427 0.012815 0.0978772 0.0193566 0.3537836 0.0147321 -0.02872 0.007832 0.0287271 -0.0105185 -0.0037325 -0.0046233 -0.0020222 0.1291643 0.0650212 0.0084618 -0.0520172 -0.0317022 0.0991256 0.0331893 0.0068652 0.0585505 0.0514277 0.0284723 -0.0132354 0.056831 -0.0358331 0.0927489 -0.0357048 0.0029851 -0.061879 0.0235121 -0.3289045 -0.0073627 0.1150491 -0.0565031 -0.2492596 -0.0515569 0.1296187 -0.0773163 -0.3791015 -1.0041082 -0.0417268 -0.3069397 -0.0694672 -0.5234506 0.0223268 -0.4150516 0.0436744 -0.8585213 -0.577642 0.1139208 -0.0051746 -0.023443 -1.2656319 0.0927474 0.0381189 0.0208577 -0.4635466 0.2099526 -0.0562512 0.1238941 -0.0627086 0.1612974 -0.026744 0.1563726 -0.0195265 0.2985195 -0.3309839 0.0057062 -0.0274103 0.0076296 -0.3025536 0.0061767 -0.0393368 0.0052437 -0.3345975 unknown
polarizability: 104.7726329|8.5988256|75.1086979|14.5441343|-18.6688201|104.6068717 unknown
InChI: InChI=1/C4H5BF2N4/c1-11-3(2-8)4(5(6)7)9-10-11/h5,9H,1H3
charge 0 multiplicity 1
16 atoms
C  1.60313819 0.03124986 -0.04165356
C  -0.31976016 -1.31224336 0.93308205
C  -1.6051597 -1.59364707 0.51299076
N  0.25059508 -0.51836251 -0.02529258
N  -0.56922215 -0.28316421 -1.00078052
N  -1.65994613 -0.92855363 -0.66078074
B  -2.91141477 -2.43952084 1.0646738
H  -2.46921512 -0.90934976 -1.27185904
H  2.3171385 -0.78961007 -0.08710786
H  1.68966484 0.66166741 -0.92220945
H  1.75705459 0.61605223 0.86373292
H  -3.31002004 -1.96863102 2.1110993
F  -3.8704852 -2.28070511 0.00650461
F  -2.52836253 -3.79389691 1.18167673
C  0.38466353 -1.69900138 2.09936724
N  0.98627301 -1.98847255 3.03572175
