program: Gaussian 16
title: f_dibenzofuran_h2
version: ES64L-G16RevC.02
method: RwB97XD
basis: GenECP
operation: Freq
keyword: #N
keyword: Geom=AllCheck
keyword: Guess=TCheck
keyword: SCRF=Check
keyword: GenChk
keyword: RwB97XD/GenECPFreq
converged: YES YES NO NO
title: Mulliken charges:
elementType: C C O C C C C C H C H H C H C H C C H B N C H H H C H H H F F H H
charge: -0.580830 1.139079 0.029357 0.934977 -0.783020 -0.506589 -0.290107 -0.383755 0.201726 -0.279469 0.254558 0.208668 -0.366554 0.183716 -0.438413 0.223580 0.203747 -0.700775 0.233973 0.308434 0.026276 -0.380947 0.233953 0.223283 0.247244 -0.352448 0.224399 0.227898 0.247550 -0.295345 -0.313327 -0.130532 0.449695
chargesum: -0.00000
title: Mulliken charges with hydrogens summed into heavy atoms:
elementType: C C O C C C C C C C C C C B N C C F F
charge: -0.580830 1.139079 0.029357 0.934977 -0.783020 -0.304862 -0.290107 -0.129197 -0.070801 -0.182838 -0.214833 0.437720 -0.700775 0.177902 0.475971 0.323532 0.347398 -0.295345 -0.313327
chargesum: 0.00000
1716.lowfreq: -8.6889 0.0006 0.0010 0.0011 8.1449 10.4035 50.9589 59.0291 66.0765
frequency: 49.8268 58.4063 65.1097 80.5859 84.9083 134.9491 148.7293 175.4391 254.3533 257.3323 267.0606 279.0492 283.9885 297.1197 308.2439 332.4378 373.2915 434.3589 451.9652 479.2919 506.0096 559.5735 578.7716 581.0172 594.3498 621.0596 637.3713 676.5441 703.7994 754.2765 761.5362 782.9327 802.4206 816.8091 854.6501 883.2663 884.9700 896.3381 925.8709 926.3715 946.4298 981.5773 999.8058 1009.0534 1027.6261 1071.1921 1075.8830 1086.2142 1097.3701 1104.1286 1155.5698 1174.7773 1182.1002 1193.4918 1197.4072 1206.2325 1254.0228 1273.4481 1277.8803 1312.6060 1336.3390 1355.1459 1390.7926 1434.4928 1444.4450 1456.1243 1460.7836 1485.4261 1490.7784 1501.4993 1505.0182 1509.7385 1518.8230 1536.1496 1547.5905 1652.2387 1666.5239 1669.5998 1720.7006 2323.0202 3089.4748 3092.9735 3183.9714 3193.3494 3195.5244 3197.8738 3201.5810 3204.3482 3205.8762 3209.3909 3212.5363 3225.0344 3428.0758
redmass: 4.4015 9.8453 3.5739 4.8950 5.2648 4.6313 4.4992 4.1554 1.6218 2.8294 2.2730 1.7869 3.3139 4.3793 2.4376 6.7009 4.1795 3.4395 9.1631 4.2216 4.8370 3.5287 3.8362 7.0028 5.4800 4.8071 4.2649 5.1143 6.8783 1.9674 5.5843 1.6911 2.6429 2.6998 5.6937 5.0677 5.6428 5.8197 2.1629 1.9537 1.3986 3.2518 1.3219 1.3311 2.1712 1.9574 1.1809 1.8979 1.5156 1.7035 2.2443 1.6526 1.3600 1.7721 1.5486 2.3057 2.3412 1.6976 2.2111 2.1815 2.7718 6.5008 3.5358 2.5934 1.1704 1.3995 1.3019 1.1598 1.0438 1.3241 1.6989 1.0417 1.1375 2.9501 3.2075 7.0980 8.0475 7.2688 8.2498 1.0766 1.0310 1.0314 1.0864 1.1086 1.1082 1.0912 1.1066 1.0910 1.1083 1.0971 1.0928 1.0975 1.0776
irintensity: 4.3274 0.8456 7.2269 14.5493 5.3967 1.3666 2.1880 0.2941 0.3438 8.8394 2.5346 3.4604 0.6998 1.4534 2.9909 0.7933 4.4139 1.0721 2.0487 11.0956 6.2859 1.0282 0.7927 11.1561 6.6507 18.1663 6.0721 18.1034 1.8837 23.5757 1.7193 95.5417 29.9179 18.3888 31.5654 143.3744 28.7592 75.5162 55.7906 30.2724 1.8734 38.7418 0.1392 1.3805 18.2308 71.9808 4.1327 3.2122 114.4160 192.6727 153.0959 87.9115 30.2983 8.8751 25.9569 104.5728 33.7507 8.4216 25.6497 37.8283 55.4444 2.3963 2.2094 78.5534 3.4077 57.3800 42.0317 10.2041 1.4365 25.6303 28.4993 27.8654 32.1014 95.2849 14.6303 31.6653 25.0819 0.8362 39.2045 463.6994 3.7243 5.6302 2.6215 0.9912 4.7953 12.9676 1.1375 1.3616 0.7997 25.7135 8.8888 6.7617 112.8097
temp: 298.150 k
press: 1.00000 atm
elementType: 6 6 8 6 6 6 6 6 1 6 1 1 6 1 6 1 6 6 1 5 7 6 1 1 1 6 1 1 1 9 9 1 1
symmnumber: 1
zpe: 686874.5 jmol-1
zpe.correction: 0.261617 hartree
zpe.thermalcorrener: 0.277752 hartree
zpe.thermalcorrenthalpy: 0.278696 hartree
zpe.thermalcorrgfe: 0.217720 hartree
zpe.sumelectzpe: -896.199605 hartree
zpe.sumelectthermal: -896.183470 hartree
zpe.sumelectthermalent: -896.182526 hartree
zpe.sumelectthermalfe: -896.243501 hartree
dipole: 21.7767 2.5910 0.3648
dipole: 21.9334
quadrupole: -112.7509 -103.5591 -112.2989
quadrupole: -43.1613 0.5383 -1.4731
quadrupole: -3.2146 5.9772 -2.7626 -43.1613 0.5383 -1.4731
hfenergy: -896.4612213 hartree
pointgroup: C01 [X(C14H14B1F2N1O1)]
dipole: 8.5676231 1.0193825 0.1435181 debye
polarizability: 296.2672841|-6.0968683|232.8107853|-5.074272|-1.9468084|128.1432519 unknown
InChI: InChI=1/C14H14BF2NO/c1-18(2)12-8-4-6-10-9-5-3-7-11(15(16)17)13(9)19-14(10)12/h3-8,15,18H,1-2H3
charge 0 multiplicity 1
33 atoms
C  -1.32701753 0.32078972 0.21592181
C  -0.942324 1.66566197 0.1972317
O  -0.20197428 -0.50524416 0.19725057
C  0.5098802 1.67129579 0.15673036
C  0.85591226 0.31695086 0.15726335
C  1.53458507 2.61173079 0.11209742
C  2.16115546 -0.11853607 0.10679687
C  2.85704698 2.17386788 0.06667372
H  1.31378407 3.67239353 0.10953503
C  3.18391154 0.81561309 0.06040369
H  3.65858403 2.901167 0.03138547
H  4.22254388 0.50941584 0.01766383
C  -1.93656925 2.64462142 0.21610198
H  -1.68743249 3.69943966 0.20335095
C  -3.25427552 2.21453742 0.25045783
H  -4.0529503 2.94837398 0.26383682
C  -3.57841308 0.84867515 0.26581422
C  -2.6205313 -0.16781821 0.24868329
H  -4.62376569 0.55810732 0.28970512
B  -2.95452679 -1.76391354 0.30852553
N  2.3634827 -1.5752159 0.08590863
C  2.94076034 -2.05255934 -1.20907074
H  3.95057783 -1.65850671 -1.30351033
H  2.95618177 -3.14093889 -1.20016976
H  2.31293918 -1.68563796 -2.01791721
C  3.13249301 -2.07184633 1.26760218
H  3.15766872 -3.15951909 1.23068665
H  4.14201635 -1.66869267 1.22044125
H  2.63013759 -1.73059445 2.16987508
F  -2.25483838 -2.43664013 -0.76761494
F  -4.3632304 -1.957883 0.12068
H  -2.59996969 -2.24968789 1.38412861
H  1.41918304 -1.97145188 0.15348208
