program: Gaussian 16
title: Me_F-H2
version: ES64L-G16RevC.01
method: RwB97XD
basis: GenECP
operation: Freq
keyword: #N
keyword: Geom=AllCheck
keyword: Guess=TCheck
keyword: SCRF=Check
keyword: GenChk
keyword: RwB97XD/GenECP
keyword: Freq
converged: YES YES YES YES
title: Mulliken charges:
elementType: H C C C C H C H C H B C H H H C H H H N H H F F
charge: 0.221175 -0.281656 -0.080126 -0.392164 -0.484803 0.251957 -0.177344 0.232316 -0.034223 0.169702 0.275770 -0.369953 0.241670 0.215548 0.198877 -0.373154 0.224139 0.203516 0.198991 -0.074631 -0.026529 0.440092 -0.291202 -0.287968
chargesum: -0.00000
title: Mulliken charges with hydrogens summed into heavy atoms:
elementType: C C C C C C B C C N F F
charge: -0.060481 0.171831 -0.159848 -0.484803 -0.007642 -0.034223 0.249241 0.286142 0.253492 0.365461 -0.291202 -0.287968
1716.lowfreq: -4.6066 -0.0009 -0.0003 0.0003 6.9366 11.7688 46.1258 75.9154 111.9138
frequency: 45.1074 75.7575 111.9042 147.9838 179.8402 210.2243 230.1427 249.5887 302.1890 322.6161 344.8571 402.5599 427.3365 457.9530 516.5989 567.8787 593.7598 628.7852 711.4620 772.0300 790.0881 801.8378 809.3154 899.5498 952.8723 977.9652 982.8991 1027.1490 1044.7232 1068.2885 1076.7216 1086.1077 1101.0857 1144.3195 1159.5268 1191.9213 1197.7629 1200.2906 1232.7695 1280.9698 1304.7575 1334.4218 1450.3104 1467.5262 1478.4585 1481.7547 1489.7315 1504.4057 1505.9241 1513.7982 1530.1722 1569.4529 1645.0670 1685.8073 2384.0675 3076.0426 3083.2223 3112.3807 3178.4769 3181.6573 3187.9683 3188.0925 3193.5138 3199.3767 3205.9590 3217.4483
redmass: 3.3137 5.3274 3.6694 3.6661 4.8469 1.2451 2.0544 1.3003 4.1952 4.8031 3.8995 3.6373 4.3872 5.4759 3.9541 3.3884 3.5077 4.6420 3.4387 2.5715 1.8882 5.1720 4.1810 1.4495 3.0711 3.0458 1.4707 1.3314 1.8789 2.0287 1.9840 1.2526 1.5620 1.8205 1.6053 1.1353 2.2100 2.0470 1.7740 1.8712 1.7507 4.1239 1.1493 1.3999 1.1062 1.3356 1.0654 1.0766 1.6741 1.2078 1.2985 1.3237 5.1680 5.1830 1.0792 1.0362 1.0349 1.0774 1.1080 1.1060 1.1032 1.0909 1.1056 1.0913 1.0945 1.0987
irintensity: 0.2406 1.3442 4.1036 1.0803 23.8442 2.8314 3.1335 7.0298 5.8035 10.7947 8.1854 6.5882 0.6350 3.5725 8.1242 20.4591 11.5563 17.3494 44.3848 59.3630 16.2568 125.5063 15.8328 4.6645 16.1946 127.3434 8.2417 0.6074 15.2360 39.0082 40.6991 7.6391 97.2874 119.6856 54.2693 2.0807 178.4713 4.8178 29.2337 0.3853 13.0486 13.0645 4.6629 16.8809 0.4217 20.9216 6.5988 17.4814 20.5681 14.4467 34.5335 45.4156 17.4085 12.8847 362.7437 120.8631 66.4146 596.1385 0.0445 13.6376 0.6026 1.7272 0.5078 3.5876 23.2345 12.3709
temp: 298.150 k
press: 1.00000 atm
elementType: 1 6 6 6 6 1 6 1 6 1 5 6 1 1 1 6 1 1 1 7 1 1 9 9
symmnumber: 1
zpe: 517352.2 jmol-1
zpe.correction: 0.197049 hartree
zpe.thermalcorrener: 0.208704 hartree
zpe.thermalcorrenthalpy: 0.209648 hartree
zpe.thermalcorrgfe: 0.159276 hartree
zpe.sumelectzpe: -591.245532 hartree
zpe.sumelectthermal: -591.233877 hartree
zpe.sumelectthermalent: -591.232933 hartree
zpe.sumelectthermalfe: -591.283305 hartree
dipole: 2.9509 -10.7408 0.2020
dipole: 11.1406
quadrupole: -32.8597 -98.1771 -71.9571
quadrupole: -52.7117 0.1383 3.4852
quadrupole: 34.8049 -30.5125 -4.2924 -52.7117 0.1383 3.4852
hfenergy: -591.4425812 hartree
pointgroup: C01 [X(C8H12B1F2N1)]
dipole: 1.1609778 -4.2257422 0.0794858 debye
dipolederiv: -0.1179182 0.0094962 0.0301602 0.0140808 0.0860564 -0.006373 0.032196 -0.0053859 0.147482 0.1135874 -0.0152715 -0.0276227 -0.0342995 0.0518282 0.0157264 -0.0208936 0.0236646 -0.1193322 -0.023743 -0.2306612 -0.0424222 -0.091054 0.0470319 0.0068498 -0.0227174 0.0333165 -0.1287711 -0.0551242 0.1172497 -0.011565 0.0602506 -0.0163972 -0.0046347 -0.0153906 -0.0020256 -0.1699591 -0.3502275 0.0440046 0.0549993 -0.0217858 -0.3686423 0.0369698 -0.0012062 -0.0792277 -0.182564 0.0480785 0.0637359 0.0127832 0.0884025 -0.0200589 -0.0232512 0.0095512 -0.0272817 0.1319132 -0.0721395 -0.0493519 -0.0178536 0.0313622 -0.0998484 0.0051633 -0.0114895 0.0216219 -0.115533 0.016192 -0.0799967 0.0112589 -0.0908695 -0.0416852 -0.0009556 0.0122782 -0.0046509 0.1562139 0.6801932 -0.1206851 -0.0788297 -0.160776 0.1772183 -0.012678 -0.0555297 -0.0091683 -0.121007 0.0550222 0.0892081 0.0147585 0.0887264 -0.0435098 -0.0257041 0.0205068 -0.026614 0.1489966 1.4204584 -0.0468791 -0.0772896 0.0134195 1.6992847 -0.0935645 -0.1418797 -0.1423262 1.2217273 0.1048666 -0.0167402 -0.0938346 -0.117729 0.2889822 0.1739633 -0.1711583 0.1378171 0.2779897 0.0713009 0.0256044 -0.0714674 0.0408204 0.0622792 0.0168903 -0.0421427 -0.0093543 0.0114384 -0.0850869 0.0071228 0.0452854 -0.0279754 0.0727224 -0.0278416 0.0108711 -0.042144 0.0852854 0.109315 -0.0664795 0.0248383 -0.0123358 -0.0282693 0.0052483 0.0382357 0.0819628 0.0291108 0.1755046 0.016827 0.1332661 -0.0121113 0.1330003 -0.117851 0.269267 -0.0997812 0.3032355 0.0709873 -0.0893304 0.0055184 -0.029762 -0.0366361 0.0549708 -0.0261145 -0.0158671 0.0710372 -0.106682 0.0200354 -0.003739 0.0113919 0.1081217 0.0231411 0.0221204 0.0225535 0.0524878 0.0990651 0.0394196 0.0209912 0.0152628 0.0562613 -0.0591047 0.0088439 -0.0180743 0.0316796 -0.4729002 0.0157069 0.0296844 0.1095805 -0.573605 0.0210863 -0.0726235 0.0512482 -0.2749075 -0.3124664 -0.0986498 -0.1373045 -0.1008799 -0.3333524 -0.0711037 -0.1259166 -0.0596467 -0.4325917 0.2181175 0.0632044 -0.0384666 0.0237062 0.8753326 -0.1181153 -0.0283987 -0.1522463 0.1634431 -0.9641513 0.0028725 0.3209027 -0.0020816 -0.8998476 0.0210644 0.434286 0.026938 -0.7547499 -0.6222496 0.2995577 -0.1040518 0.2046564 -1.196267 0.1801035 -0.1226954 0.2946717 -0.532625 unknown
polarizability: 151.2114484|0.3469732|141.8658961|-4.1873384|5.037569|93.2925314 unknown
InChI: InChI=1/C8H12BF2N/c1-12(2)8-6-4-3-5-7(8)9(10)11/h3-6,9,12H,1-2H3
charge 0 multiplicity 1
24 atoms
H  0.44783436 0.4151066 0.46542303
C  1.51959345 0.31002131 0.3371481
C  2.32924254 1.43820418 0.31069569
C  2.07781935 -0.95733316 0.20009642
C  3.71652901 1.35349255 0.14297495
H  1.88370812 2.42125373 0.41813626
C  3.44858697 -1.08593725 0.02532113
H  1.45211018 -1.84173775 0.22375114
C  4.22289204 0.06580978 -0.00698197
H  3.88748616 -2.07089967 -0.08607619
B  4.64841445 2.6924364 0.22051513
C  6.12131745 -0.98321598 -1.25104151
H  5.56739359 -0.74671802 -2.1570615
H  7.18910323 -0.84790544 -1.41777178
H  5.92797028 -2.01090774 -0.94917414
C  6.37581585 -0.3192571 1.11705077
H  6.05383473 -1.29084674 1.48970947
H  7.45369036 -0.30928714 0.95818088
H  6.09191354 0.46516597 1.81651872
N  5.6941047 -0.04910368 -0.17893401
H  5.11939038 2.84550454 1.34070137
H  5.97378279 0.90947106 -0.47818224
F  5.7994214 2.50092378 -0.71436859
F  3.93120121 3.82821348 -0.20811344
