program: Gaussian 16
title: MeQFBF2-H2
version: ES64L-G16RevC.01
method: RwB97XD
basis: GenECP
operation: Freq
keyword: #N
keyword: Geom=AllCheck
keyword: Guess=TCheck
keyword: SCRF=Check
keyword: GenChk
keyword: RwB97XD/GenECP
keyword: Freq
converged: YES YES YES YES
title: Mulliken charges:
elementType: C C C N N N B H H H H H F F F
charge: -0.411155 0.176403 -0.294511 0.147632 -0.127657 -0.112443 0.240211 0.455725 0.230619 0.222869 0.233989 -0.126447 -0.264402 -0.272363 -0.098470
chargesum: -0.00000
title: Mulliken charges with hydrogens summed into heavy atoms:
elementType: C C C N N N B F F F
charge: 0.276322 0.176403 -0.294511 0.147632 -0.127657 0.343282 0.113764 -0.264402 -0.272363 -0.098470
1716.lowfreq: -15.2462 0.0007 0.0009 0.0011 5.9213 14.4798 21.4799 81.2435 103.1257
frequency: 17.4695 81.0829 103.0093 104.4028 205.6180 272.6801 293.8979 333.5038 414.5200 482.1026 491.8950 647.0691 695.4977 716.9564 726.4338 803.3382 811.5093 945.6719 950.7485 1073.3611 1089.1281 1119.9581 1132.0690 1162.3613 1255.8111 1288.5731 1326.7904 1416.9850 1454.1663 1487.4298 1493.6285 1507.1111 1571.9973 1664.2246 2382.0593 3093.1396 3186.1950 3208.9601 3635.3241
redmass: 11.3791 5.1279 1.2574 4.5709 4.7007 4.4616 8.8068 5.9143 10.9035 10.8866 4.3661 5.0997 10.3771 7.8134 8.6722 6.6446 1.1497 3.6311 5.1235 3.0491 2.0370 1.4328 1.5639 1.3290 1.8767 10.0823 8.3734 3.0426 1.5253 1.0339 2.3187 1.2230 3.9945 7.3178 1.0789 1.0317 1.1076 1.1071 1.0842
irintensity: 0.0440 0.0285 1.1273 4.4761 1.4009 0.2036 21.1397 2.3293 4.3879 5.2601 19.2697 24.4145 0.0655 28.9406 2.4433 70.6071 101.0227 150.9411 129.7828 0.2125 102.4847 208.4527 213.2519 0.0527 171.0224 18.3033 20.9007 14.3526 6.5635 20.8711 33.3472 0.2191 66.0108 219.4972 387.4863 5.3217 0.5769 0.1175 186.4202
temp: 298.150 k
press: 1.00000 atm
elementType: 6 6 6 7 7 7 5 1 1 1 1 1 9 9 9
symmnumber: 1
zpe: 267046.4 jmol-1
zpe.correction: 0.101713 hartree
zpe.thermalcorrener: 0.111144 hartree
zpe.thermalcorrenthalpy: 0.112088 hartree
zpe.thermalcorrgfe: 0.064968 hartree
zpe.sumelectzpe: -605.903770 hartree
zpe.sumelectthermal: -605.894339 hartree
zpe.sumelectthermalent: -605.893395 hartree
zpe.sumelectthermalfe: -605.940515 hartree
dipole: 7.7844 7.6030 -4.8211
dipole: 11.9015
quadrupole: -68.4428 -84.5190 -65.4919
quadrupole: -23.4615 15.5939 12.4840
quadrupole: 4.3751 -11.7011 7.3260 -23.4615 15.5939 12.4840
hfenergy: -606.005483 hartree
pointgroup: C01 [X(C3H5B1F3N3)]
dipole: 3.0626159 2.9912496 -1.8967833 debye
dipolederiv: 0.5575467 0.1379584 -0.0239791 0.1213721 0.1905393 0.0296723 -0.0162346 0.0317587 0.1515388 0.7180235 -0.6254384 0.7344277 -0.2803823 0.4891392 -0.3592772 0.4055503 -0.4528097 0.7283093 -0.3061827 0.1525707 -0.2188316 -0.121953 -0.1912991 0.1183436 0.0577491 0.2020629 -0.2042363 -0.5062436 -0.170853 0.027561 0.0719567 0.1302092 -0.1262738 -0.197229 -0.1907749 0.1014465 0.2237104 -0.0811199 0.1587757 -0.160449 -0.4837644 0.3384397 0.2359283 0.3592624 -0.3490233 -0.4642666 0.0839651 -0.1714491 0.0538018 0.2301106 -0.3221007 -0.1444293 -0.3145306 0.1283371 1.5181237 0.1466998 -0.1422656 0.2271198 1.7007491 -0.0378211 -0.2178172 -0.0553638 1.6001509 0.3907882 -0.0143591 0.035243 -0.0457275 0.297783 0.00014 0.0672521 0.0080927 0.3227525 0.0052209 -0.0301306 0.0074204 0.0324712 -0.0015095 -0.0379306 0.0195431 -0.0244712 0.114915 0.0528099 0.0234597 -0.0457818 -0.0299181 0.0742406 0.0451391 0.0077936 0.0611729 0.0692409 0.0136144 -0.0255649 0.0388222 -0.0399613 0.1011055 -0.0208172 -0.0196659 -0.0489727 -0.0036477 -0.5089816 0.029142 -0.0923797 0.0322396 -0.2759099 0.0778231 -0.0995894 0.0772933 -0.2832588 -0.5836757 0.1095739 0.0680647 -0.0536567 -1.3243406 -0.1034382 0.0511853 -0.0928414 -0.5183159 -0.5793087 -0.0682394 0.0620823 -0.076485 -0.5354765 0.0226756 0.2258398 0.0476905 -1.3069054 -0.5311788 0.3323357 -0.43771 0.2695717 -0.4015764 0.3754255 -0.375876 0.3924307 -0.5513035 unknown
polarizability: 91.197821|9.352374|72.7138343|1.4153338|-14.8597999|68.3635141 unknown
InChI: InChI=1/C3H5BF3N3/c1-10-3(5)2(4(6)7)8-9-10/h4,8H,1H3
charge 0 multiplicity 1
15 atoms
C  1.59866879 0.02637178 -0.03594325
C  -0.31814996 -1.40234145 0.78052075
C  -1.65984798 -1.50229906 0.50577335
N  0.21360828 -0.42732962 0.00893212
N  -0.70221394 0.11748866 -0.7546783
N  -1.79018165 -0.53893244 -0.43514234
B  -2.9219077 -2.43404163 1.02209398
H  -2.65499051 -0.29475929 -0.90153255
H  2.23982439 -0.81176786 -0.30345185
H  1.65916287 0.80614876 -0.79026716
H  1.87815915 0.41955742 0.94001137
H  -3.93281001 -2.02976589 0.45962159
F  -2.62477101 -3.77794989 0.67609893
F  -3.00544396 -2.29884129 2.4312788
F  0.44061463 -2.06321969 1.61069626
