program: Gaussian 16
title: f_indenoPy_h2
version: ES64L-G16RevC.02
method: RwB97XD
basis: GenECP
operation: Freq
keyword: #N
keyword: Geom=AllCheck
keyword: Guess=TCheck
keyword: SCRF=Check
keyword: GenChk
keyword: RwB97XD/GenECP
keyword: Freq
converged: YES YES YES YES
title: Mulliken charges:
elementType: C C C C C C H H H C H H C C C C C H H H N B F F H H
charge: 0.101808 -0.328961 -0.465022 0.080373 -0.369628 -0.127758 0.238211 0.231200 0.211986 -0.555875 0.230631 0.229338 -1.312551 0.402171 0.402548 0.913531 -0.720649 0.302692 0.278745 0.269287 0.044570 0.110228 -0.281219 -0.279212 -0.027309 0.420866
chargesum: -0.00000
title: Mulliken charges with hydrogens summed into heavy atoms:
elementType: C C C C C C C C C C C C N B F F
charge: 0.101808 -0.328961 -0.465022 0.318585 -0.138428 0.084228 -0.095906 -1.312551 0.402171 0.705240 1.192276 -0.451362 0.465436 0.082919 -0.281219 -0.279212
1716.lowfreq: -8.3426 -0.0009 -0.0007 -0.0005 2.9069 5.7131 54.6433 79.3530 117.8404
frequency: 54.5747 79.3376 117.8401 166.0535 180.6582 224.6732 243.0669 270.2173 287.4186 351.9887 421.0853 433.4382 452.6720 477.5798 497.0414 548.0618 566.8795 574.6940 637.3772 649.6756 691.3873 750.2939 780.4996 793.4830 801.2249 812.9481 824.8057 867.6918 918.4290 933.5536 957.9849 975.9253 981.1215 1018.4455 1026.9410 1030.4398 1046.3312 1080.9523 1085.9232 1117.1302 1133.6930 1148.4792 1178.5591 1192.4909 1209.0076 1218.4917 1246.1220 1262.0368 1289.8380 1314.9282 1353.3560 1400.0050 1414.5312 1448.5786 1459.6875 1510.1701 1515.3191 1589.9917 1650.7987 1658.7720 1692.3883 1710.1125 2363.1189 3065.9772 3106.6916 3162.2962 3183.1684 3198.6097 3207.5462 3208.0529 3239.1010 3257.1708
redmass: 8.7492 4.4478 5.4477 4.8197 8.3136 6.3794 2.2266 5.7443 6.6222 6.2506 3.5262 5.1816 10.1925 2.9789 4.6118 4.2127 5.8839 3.2814 5.9930 5.9566 4.4765 4.1328 4.8978 2.9916 1.4957 1.6677 3.2087 4.8762 3.4883 1.8924 1.4322 1.6376 2.2811 1.4762 1.3471 1.3632 4.0993 2.0873 1.4582 1.5431 1.7180 1.7782 1.1404 1.3080 1.4040 1.6690 2.5805 2.8180 2.9439 1.9685 4.8350 1.9134 2.7792 1.1571 3.0743 2.6930 2.5626 2.5992 6.0633 6.4739 4.6839 4.2046 1.0782 1.0611 1.1026 1.0913 1.0870 1.0919 1.0968 1.0928 1.0923 1.0992
irintensity: 0.2345 3.0879 0.0250 4.2497 20.9619 7.1865 10.2255 11.7783 11.0945 1.5291 4.5859 12.5342 10.8577 0.7762 2.5578 1.2591 2.0821 3.8369 4.1425 5.8230 6.1046 28.1586 51.5748 53.9989 152.9294 4.9066 23.5959 5.9500 68.5349 13.5381 6.0771 10.5802 70.4037 22.7700 2.4648 29.4605 8.3899 13.1757 96.5906 62.7241 176.3396 96.7339 0.2156 63.4563 3.3458 26.8878 66.4068 45.0420 101.8648 16.9971 37.8259 166.9036 1.5483 15.2439 11.6461 34.1763 10.4076 42.3397 31.8155 59.4405 50.7301 324.8458 344.7714 6.1012 1.7903 961.2453 1.3218 9.0008 33.0328 3.7466 0.4422 0.0393
temp: 298.150 k
press: 1.00000 atm
elementType: 6 6 6 6 6 6 1 1 1 6 1 1 6 6 6 6 6 1 1 1 7 5 9 9 1 1
symmnumber: 1
zpe: 522283.2 jmol-1
zpe.correction: 0.198927 hartree
zpe.thermalcorrener: 0.210963 hartree
zpe.thermalcorrenthalpy: 0.211908 hartree
zpe.thermalcorrgfe: 0.160437 hartree
zpe.sumelectzpe: -742.461811 hartree
zpe.sumelectthermal: -742.449775 hartree
zpe.sumelectthermalent: -742.448831 hartree
zpe.sumelectthermalfe: -742.500302 hartree
dipole: -12.3511 5.5087 0.1038
dipole: 13.5243
quadrupole: -80.9218 -87.7402 -97.3121
quadrupole: 19.0565 -0.0072 0.4842
quadrupole: 7.7363 0.9178 -8.6541 19.0565 -0.0072 0.4842
hfenergy: -742.6607386 hartree
pointgroup: C01 [X(C12H10B1F2N1)]
dipole: -4.8592839 2.1672921 0.0408562 debye
dipolederiv: 0.2549452 -0.1224383 0.005555 0.4024001 0.0688007 -0.0137955 0.0135815 -0.0024781 -0.0542846 -0.7941463 -0.4810109 0.0086131 -0.4177619 -0.3699033 -0.0131785 -0.0268855 -0.0372078 -0.0551139 0.1036766 0.3527521 -0.0002895 -0.0711755 -0.1875725 0.0606491 0.0274317 -0.0552527 -0.1599053 0.1174222 -0.1992132 -0.0260289 -0.1538096 -0.4744507 -0.0423798 -0.025654 0.0020333 -0.1479555 0.1306324 -0.1205484 -0.0123772 -0.0827177 0.2373676 0.0269031 -0.0009927 0.0357583 -0.1075334 -0.516849 0.0841772 0.0168031 -0.0338584 0.1182131 0.0005521 -0.0000574 0.0083899 -0.1733638 -0.0878321 0.0193185 0.006958 0.0436717 0.0982789 -0.0035448 0.0113493 -0.0209068 0.1370516 -0.0540208 -0.1118298 -0.0036275 -0.1077287 0.0004525 -0.0074458 0.0003161 -0.0063631 0.1441476 0.0741291 0.0463153 0.0028438 0.000677 -0.1136669 -0.0087049 -0.0006772 -0.0094161 0.1545423 0.0008604 0.0474357 -0.0032193 0.0957506 -0.0664695 -0.0068015 0.0081192 0.0034971 0.1855095 -0.0000664 -0.0058361 -0.0243095 -0.0150336 0.0352975 0.04598 -0.0517622 0.0853113 0.0169689 -0.0009333 -0.0085639 0.0299368 -0.0115313 0.0392885 -0.0437646 0.0522208 -0.0840116 0.0140344 1.7456098 0.8689087 -0.0240117 0.0280745 0.3208705 -0.0097344 -0.0089558 -0.0271608 0.1741962 -1.3173425 -0.4242692 0.0196793 0.462988 0.4155963 0.0082308 0.0082798 0.0221844 -0.0599004 -0.2006094 -0.5916136 0.0144818 0.1877109 0.2946463 -0.0068929 -0.0059314 -0.0078905 0.0190368 0.7920495 0.160663 -0.0095793 0.4756348 0.5310636 -0.0151257 -0.0053097 -0.0090534 -0.0426597 0.0862665 0.2571708 -0.0013191 -0.6372305 -0.6894053 0.0153669 0.0222991 0.0203935 -0.1544976 0.0851841 0.0078477 -0.0011615 -0.0147602 0.0477225 0.0032437 -0.0100107 -0.0012828 0.1626185 0.0463853 0.0558266 -0.000546 0.0909628 0.0425183 0.0012087 -0.0028178 -0.0017525 0.137144 0.010889 -0.0433376 -0.0013333 -0.0547999 0.0778528 0.0007267 -0.0007719 -0.0001404 0.1681841 -0.4309098 0.4430289 -0.0327008 0.0267261 -0.4844737 0.021892 -0.0320185 0.0130503 -0.1258551 1.5958691 -0.1922302 -0.0200771 -0.2983698 1.4986347 -0.1109146 -0.0217772 -0.1749809 1.1665755 -0.9467644 0.0042915 0.1850138 -0.0605495 -0.8742433 0.2488867 0.181017 0.3540711 -0.7435045 -1.2496979 0.3570369 -0.1170366 0.3416022 -0.6595825 0.0287049 -0.2033161 0.074724 -0.4799991 -0.2328897 -0.0003316 -0.0710767 0.0648452 -0.3774571 -0.1449566 -0.0383626 -0.1204055 -0.4516523 0.7881424 -0.4035501 0.0588093 -0.2617171 0.4706209 -0.0351049 0.1106863 -0.0611103 0.2762157 unknown
polarizability: 257.026824|28.9442705|209.8000953|-1.2246278|3.8144862|98.9094957 unknown
InChI: InChI=1/C12H10BF2N/c14-13(15)10-5-1-3-8-7-9-4-2-6-16-12(9)11(8)10/h1-6,13,16H,7H2
charge 0 multiplicity 1
26 atoms
C  0.09875177 1.89420456 0.03781088
C  0.31801637 0.50495514 -0.00157362
C  1.59272809 -0.08104891 -0.06877833
C  2.65247571 0.82889018 -0.04170782
C  2.45555828 2.2086031 0.02917076
C  1.17666756 2.76054884 0.05772801
H  3.66482639 0.44241906 -0.08722653
H  3.31756274 2.86743565 0.04867197
H  1.03452127 3.83506041 0.0895021
C  -1.37624716 2.22003584 0.02933552
H  -1.65648915 2.81498554 -0.84502285
H  -1.68392132 2.77976727 0.91772878
C  -0.99567649 -0.11066349 0.0065074
C  -2.01123182 0.85731311 0.00006461
C  -2.59191842 -1.82844537 0.03851935
C  -3.32608607 0.45579091 -0.00821153
C  -3.61809505 -0.91855197 -0.00047921
H  -2.74418277 -2.89785124 0.07490346
H  -4.13205267 1.18103675 -0.01413941
H  -4.63982068 -1.27186753 -0.00693686
N  -1.30944536 -1.40991946 0.04315641
B  1.85699555 -1.66507481 -0.3255086
F  1.00093519 -2.46643062 0.59570948
F  3.20031169 -2.00901545 -0.05500963
H  1.52900201 -1.97369377 -1.46749444
H  -0.51870815 -2.07349737 0.15978094
