program: Gaussian 16
title: MeQNH2BF2-H2
version: ES64L-G16RevC.01
method: RwB97XD
basis: GenECP
operation: Freq
keyword: #N
keyword: Geom=AllCheck
keyword: Guess=TCheck
keyword: SCRF=Check
keyword: GenChk
keyword: RwB97XD/GenECP
keyword: Freq
converged: YES YES NO YES
title: Mulliken charges:
elementType: C C C N N N B H H H H H F F N H H
charge: -0.449394 -0.000193 -0.409769 0.169804 -0.099279 -0.140268 0.306283 0.448645 0.236101 0.214939 0.223008 -0.042326 -0.354511 -0.285549 -0.432901 0.331444 0.283965
chargesum: -0.00000
title: Mulliken charges with hydrogens summed into heavy atoms:
elementType: C C C N N N B F F N
charge: 0.224654 -0.000193 -0.409769 0.169804 -0.099279 0.308378 0.263957 -0.354511 -0.285549 0.182508
1716.lowfreq: -6.4786 -0.0007 -0.0005 0.0004 12.8530 14.4532 28.5270 99.9079 129.8417
frequency: 22.4767 99.7301 129.8382 150.8615 218.1783 284.1415 297.6724 318.4503 325.6478 347.3360 471.3097 517.7935 615.3252 665.4953 707.7784 757.8342 774.8118 789.8206 797.3892 898.7644 936.5016 1034.7521 1079.1117 1108.5024 1116.0240 1160.2819 1227.0720 1261.2645 1307.3615 1334.5682 1405.3919 1457.5951 1485.9532 1500.5114 1508.6521 1593.2510 1623.7437 1682.1169 2416.7210 3078.8970 3163.4305 3199.5554 3558.4391 3655.0152 3665.4765
redmass: 7.6054 4.9003 6.8901 1.0459 5.2337 3.0421 2.8415 5.2549 1.3338 6.2360 9.1226 3.7018 4.8355 3.6536 3.3890 2.1343 3.8589 1.3845 3.6854 5.0512 4.8242 2.5548 1.8380 1.4113 1.3595 1.3323 2.0275 1.9907 5.2957 8.2677 2.9575 1.2661 1.1710 2.4510 1.1140 3.9382 1.4725 2.6760 1.0797 1.0332 1.1064 1.1056 1.0507 1.0838 1.0963
irintensity: 0.0173 1.0308 6.1366 3.2685 3.7695 1.8095 31.6573 9.9630 78.2801 1.1006 1.1416 12.5643 12.3552 67.7321 78.1964 71.4409 113.2631 83.6644 39.5493 143.4787 184.7406 3.4973 123.7200 133.6490 221.8136 1.8492 44.3089 169.1964 3.1848 16.8444 21.6320 4.0013 21.3405 17.3991 0.3785 55.6285 8.9883 257.7350 375.2425 11.4406 2.8965 0.0602 104.0813 172.0884 82.7132
temp: 298.150 k
press: 1.00000 atm
elementType: 6 6 6 7 7 7 5 1 1 1 1 1 9 9 7 1 1
symmnumber: 1
zpe: 333464.1 jmol-1
zpe.correction: 0.127010 hartree
zpe.thermalcorrener: 0.136837 hartree
zpe.thermalcorrenthalpy: 0.137781 hartree
zpe.thermalcorrgfe: 0.090830 hartree
zpe.sumelectzpe: -562.019006 hartree
zpe.sumelectthermal: -562.009179 hartree
zpe.sumelectthermalent: -562.008235 hartree
zpe.sumelectthermalfe: -562.055185 hartree
dipole: 8.8435 4.4742 -4.4087
dipole: 10.8472
quadrupole: -72.8274 -71.9927 -67.7931
quadrupole: -23.5634 15.9074 9.6051
quadrupole: -1.9564 -1.1217 3.0780 -23.5634 15.9074 9.6051
hfenergy: -562.1460155 hartree
pointgroup: C01 [X(C3H7B1F2N4)]
dipole: 3.4793017 1.7602763 -1.7344974 debye
dipolederiv: 0.5293458 0.1685582 -0.0951943 0.1061938 0.1990234 0.0033323 -0.0223249 0.047147 0.174506 0.5450597 -0.8529774 0.741472 -0.3558014 0.4893164 -0.3651288 0.4207113 -0.4191518 0.526764 -0.2129138 0.4287559 -0.3044818 -0.2401509 -0.3936493 0.2086672 0.086349 0.1506975 -0.2143282 -0.4171242 -0.2627727 0.1455856 0.1077203 0.1966138 -0.1303187 -0.2012658 -0.2098268 0.0447768 0.1422533 -0.0566455 0.058427 -0.1610517 -0.7544902 0.4125319 0.1700937 0.4905488 -0.4163559 -0.450902 0.1403363 -0.1563747 0.1036258 0.4089686 -0.3405207 -0.1442665 -0.3668885 0.1212108 1.6994712 0.0081614 -0.1138475 0.029611 1.4159965 -0.0679167 -0.2237294 -0.1502409 1.4080848 0.377878 -0.0474769 0.0360074 -0.0522313 0.2916422 0.0069412 0.047311 0.0114374 0.3132441 -0.0223123 -0.038284 0.0317759 0.0364721 0.0112121 -0.0786838 0.0531945 -0.057245 0.0515441 0.0571133 0.0491469 -0.0199406 -0.0322808 0.0166044 0.0394736 0.0124708 0.0463858 0.1097151 0.0229486 -0.0353277 0.0277615 -0.0078665 0.1187853 0.0258141 -0.0463062 -0.0142479 -0.0091006 -0.3346555 -0.1491253 -0.0669113 -0.1529553 -0.3571854 -0.1219012 -0.0474926 -0.0948696 -0.3643155 -0.7203044 0.1013295 -0.1698735 0.0513467 -0.7807376 0.2917906 -0.1608229 0.3806918 -0.8760634 -1.0843639 0.1450536 0.285823 0.2823605 -0.6639895 -0.162389 0.390814 -0.1253786 -0.671756 -0.7085315 0.3675347 -0.4889359 0.119438 -0.6430988 0.1831558 -0.4670141 0.4020288 -0.8027596 0.290967 0.0579192 -0.010985 0.0623278 0.2660036 -0.0033885 -0.0161528 -0.0661936 0.3626198 0.2860706 -0.0241863 0.099692 0.1032421 0.1789845 0.0985408 0.1484308 -0.0248945 0.2422136 unknown
polarizability: 102.4779594|6.5784328|89.9782696|3.0734615|-18.036032|75.0749423 unknown
InChI: InChI=1/C3H7BF2N4/c1-10-3(7)2(4(5)6)8-9-10/h4,8H,7H2,1H3
charge 0 multiplicity 1
17 atoms
C  1.59756929 0.15579548 -0.03802559
C  -0.23891524 -1.39450837 0.70937128
C  -1.61027835 -1.42789213 0.50360107
N  0.22345455 -0.30739885 0.03763012
N  -0.73781354 0.34206713 -0.58948758
N  -1.80783975 -0.34564338 -0.27824524
B  -2.74234163 -2.49601457 1.00585673
H  -2.69664384 -0.02457071 -0.63711942
H  2.17696621 -0.49809914 -0.69082975
H  1.59003542 1.16630442 -0.43814415
H  2.01984976 0.15078756 0.96692451
H  -3.14327258 -3.18060239 0.0784391
F  -2.08255196 -3.30932085 1.99616889
F  -3.80842732 -1.7649253 1.60333721
N  0.56149956 -2.18062282 1.49998815
H  0.02130017 -2.92009636 1.93541398
H  1.40761283 -2.52368559 1.06738966
