program: Gaussian 16
title: MeIM-H2
version: ES64L-G16RevC.01
method: RwB97XD
basis: GenECP
operation: Freq
keyword: #N
keyword: Geom=AllCheck
keyword: Guess=TCheck
keyword: SCRF=Check
keyword: GenChk
keyword: RwB97XD/GenECP
keyword: Freq
converged: YES YES YES YES
title: Mulliken charges:
elementType: C C H C N N N B F F H H H H H
charge: -0.407521 -0.301823 0.270545 -0.256470 0.241600 -0.051151 -0.220267 0.248313 -0.318543 -0.260499 -0.049151 0.441907 0.215014 0.219528 0.228518
chargesum: 0.00000
title: Mulliken charges with hydrogens summed into heavy atoms:
elementType: C C C N N N B F F
charge: 0.255539 -0.031279 -0.256470 0.241600 -0.051151 0.221640 0.199162 -0.318543 -0.260499
1716.lowfreq: -18.2214 -8.6671 -0.0011 -0.0007 -0.0006 14.6170 37.3661 62.4816 99.6588
frequency: 36.9493 62.2110 99.5180 129.7373 243.3505 304.8685 357.6696 434.3087 478.8350 608.5789 690.8660 723.7193 754.7452 816.8412 846.3898 897.1907 947.3141 1047.1520 1080.5188 1093.6545 1105.2490 1124.0225 1159.6717 1176.0240 1245.8839 1330.1606 1415.6409 1450.7734 1459.0466 1486.9235 1488.7172 1518.5708 1617.3251 2436.7318 3090.3679 3181.7460 3204.6673 3306.7529 3633.8342
redmass: 5.9827 1.0713 5.8887 5.6106 4.7236 5.6329 5.5217 4.4925 7.5226 3.9752 5.8444 4.6705 3.4663 1.1654 1.5239 5.2584 4.2827 3.0061 2.0168 2.4289 1.4281 1.6141 1.3429 1.6894 1.8437 6.8662 3.5687 2.0378 1.7650 1.1533 1.9846 1.4218 3.9414 1.0808 1.0322 1.1073 1.1068 1.1022 1.0842
irintensity: 0.1152 0.0078 1.1468 3.5687 8.2725 8.9908 6.9568 12.4067 2.0751 8.2452 7.1020 5.2410 62.2693 90.2796 42.7899 143.5605 152.4247 28.6563 2.9873 76.6160 136.4132 193.7926 2.2974 184.1096 48.3917 3.5585 14.2513 8.0376 8.9680 21.2836 19.2498 6.5205 9.8179 346.5834 9.0915 1.5717 0.0168 8.4827 209.5081
temp: 298.150 k
press: 1.00000 atm
elementType: 6 6 1 6 7 7 7 5 9 9 1 1 1 1 1
symmnumber: 1
zpe: 287621.3 jmol-1
zpe.correction: 0.109549 hartree
zpe.thermalcorrener: 0.118185 hartree
zpe.thermalcorrenthalpy: 0.119129 hartree
zpe.thermalcorrgfe: 0.074391 hartree
zpe.sumelectzpe: -506.671567 hartree
zpe.sumelectthermal: -506.662931 hartree
zpe.sumelectthermalent: -506.661987 hartree
zpe.sumelectthermalfe: -506.706725 hartree
dipole: 9.6955 6.4236 -1.5155
dipole: 11.7287
quadrupole: -73.8191 -76.8332 -53.0353
quadrupole: -26.3542 9.2787 4.4101
quadrupole: -5.9233 -8.9374 14.8606 -26.3542 9.2787 4.4101
hfenergy: -506.7811161 hartree
pointgroup: C01 [X(C3H6B1F2N3)]
dipole: 3.8144993 2.5272197 -0.5962454 debye
dipolederiv: 0.5515028 0.1338044 -0.0162982 0.1176127 0.1943332 0.0347189 -0.0382324 0.0287855 0.1554424 -0.0332859 -0.2809704 0.2648253 0.0573075 -0.1066598 0.054669 -0.0510342 -0.0246702 -0.0563131 0.1003632 -0.0014464 -0.0230812 -0.0000101 0.1648989 0.0326933 -0.0193394 0.0338307 0.163641 -0.0410662 0.1669941 -0.1957295 -0.0700444 -0.1113377 0.0061291 0.1715132 0.1717336 -0.1635639 -0.4272454 -0.1103682 0.0007568 0.0003561 0.2191696 -0.2298012 -0.0679255 -0.2512498 0.1600598 0.230702 -0.0558105 0.1258519 -0.1279332 -0.4959908 0.3558769 0.1623423 0.3442055 -0.3298293 -0.5143973 0.0560436 -0.145252 -0.0183688 0.148116 -0.2306606 -0.0747816 -0.2153679 0.0640168 1.5936968 0.0906253 0.0127318 0.1323675 1.6604758 -0.0576063 0.0674797 0.0017031 1.2555182 -1.0925429 0.0634309 -0.2272619 0.0922944 -0.5845475 0.1130254 -0.3553279 0.131031 -0.712807 -0.5617667 0.0369365 0.0487106 -0.0461483 -1.3044488 -0.0836069 0.0394794 -0.212484 -0.5259563 -0.2925975 -0.0535511 0.1146136 -0.0718376 -0.2389602 0.018673 0.0967619 -0.0102166 -0.4916677 0.4309448 -0.0136769 0.0447557 -0.029656 0.3083242 0.0006597 0.0592831 0.0131709 0.3206243 0.0025325 -0.0232245 0.009402 0.0516104 -0.0134287 -0.0274102 0.0199 -0.0169992 0.1162926 0.0491723 0.0186249 -0.0482669 -0.0362411 0.0730936 0.0477943 0.0147122 0.0651866 0.0553657 0.0039874 -0.0274117 0.034242 -0.051309 0.0869623 -0.0351545 -0.0248307 -0.0586592 -0.0108235 unknown
polarizability: 90.1437926|9.5097867|73.0036101|-0.2886509|-13.7903239|68.1278727 unknown
InChI: InChI=1/C3H6BF2N3/c1-9-2-3(4(5)6)7-8-9/h2,4,7H,1H3
charge 0 multiplicity 1
15 atoms
C  1.58338946 0.04319453 -0.0564191
C  -0.28490803 -1.44210423 0.77677242
H  0.34414392 -2.02229772 1.42964259
C  -1.6349681 -1.5134015 0.51514211
N  0.20822546 -0.43578376 0.01171961
N  -0.71490628 0.13850161 -0.71003095
N  -1.8008839 -0.52202791 -0.39129798
B  -2.91299703 -2.4163084 1.01341286
F  -4.0107923 -1.93081411 0.21645577
F  -2.6502975 -3.77513512 0.6972233
H  -3.12569624 -2.25780019 2.20197129
H  -2.68213413 -0.28080632 -0.82856397
H  2.24146874 -0.79908144 -0.26240833
H  1.64293729 0.77149708 -0.86088429
H  1.84933597 0.5075087 0.89214999
