program: Gaussian 16
title: f_nmeimidazole_h2
version: ES64L-G16RevC.02
method: RwB97XD
basis: GenECP
operation: Freq
keyword: #N
keyword: Geom=AllCheck
keyword: Guess=TCheck
keyword: SCRF=Check
keyword: GenChk
keyword: RwB97XD/GenECP
keyword: Freq
converged: YES YES NO NO
title: Mulliken charges:
elementType: C C H C N N B H H H H H C H F F
charge: -0.407390 0.190957 0.258804 -0.650702 0.000857 -0.204478 0.274966 0.425669 -0.153690 0.226657 0.164124 0.226544 -0.053971 0.261239 -0.282791 -0.276796
chargesum: 0.00000
title: Mulliken charges with hydrogens summed into heavy atoms:
elementType: C C C N N B C F F
charge: 0.209935 0.449761 -0.650702 0.000857 0.221191 0.121276 0.207269 -0.282791 -0.276796
chargesum: -0.00000
1716.lowfreq: -26.0138 -15.2436 -0.0005 0.0003 0.0008 9.1792 17.4958 88.7488 94.1846
frequency: -23.6496 88.6007 93.9537 132.6772 223.2382 301.6973 369.0517 384.3015 486.6255 636.0160 647.4213 695.7596 717.7321 732.5868 805.5489 839.8145 919.1627 935.8471 1006.7908 1059.6422 1098.9087 1109.1715 1120.2438 1157.6859 1160.7805 1183.1061 1259.5342 1368.8286 1426.3206 1455.7922 1465.0035 1488.4277 1517.8986 1594.2734 1651.4690 2350.7611 3083.4233 3169.9062 3187.7870 3298.9850 3308.8386 3665.8677
redmass: 4.9026 2.2329 1.6021 5.2112 3.7082 9.3876 2.7746 7.0399 9.2905 2.7267 4.4661 3.2627 1.1751 4.1854 1.5537 1.4007 3.8038 6.2618 3.8841 3.6436 1.5055 1.3778 1.4649 1.3310 1.2636 1.6004 1.7528 4.4058 2.7217 3.4064 1.2253 1.0357 1.1581 5.5208 4.1675 1.0777 1.0327 1.1071 1.1057 1.1000 1.1027 1.0829
irintensity: 1.2686 1.2625 0.0121 4.1691 0.7688 22.1199 4.1563 1.0590 0.7068 43.9504 26.2488 0.3147 83.0624 49.9594 24.4101 37.5139 162.8903 148.9780 2.3111 2.0836 2.5967 187.1085 130.0030 0.2910 57.4252 258.0488 49.8775 6.4916 1.2198 6.2725 4.0598 16.2663 12.5189 30.2392 42.0627 442.6511 19.2397 4.0535 4.0837 6.6789 17.2746 156.3338
temp: 298.150 k
press: 1.00000 atm
elementType: 6 6 1 6 7 7 5 1 1 1 1 1 6 1 9 9
symmnumber: 1
zpe: 318203.6 jmol-1
zpe.correction: 0.121197 hartree
zpe.thermalcorrener: 0.129139 hartree
zpe.thermalcorrenthalpy: 0.130083 hartree
zpe.thermalcorrgfe: 0.087822 hartree
zpe.sumelectzpe: -490.653439 hartree
zpe.sumelectthermal: -490.645497 hartree
zpe.sumelectthermalent: -490.644553 hartree
zpe.sumelectthermalfe: -490.686814 hartree
dipole: 13.9507 3.6858 0.0472
dipole: 14.4295
quadrupole: -54.7209 -41.8642 -58.8627
quadrupole: -4.2787 -0.1495 -0.0817
quadrupole: -2.9050 9.9518 -7.0468 -4.2787 -0.1495 -0.0817
hfenergy: -490.7746363 hartree
pointgroup: C01 [X(C4H7B1F2N2)]
dipole: 5.488635 1.4501205 0.0185598 debye
dipolederiv: 0.5581019 -0.2195753 0.002776 -0.2127402 0.2648379 -0.0006611 0.0022799 -0.0002655 0.2185008 -0.0592554 -0.2485147 0.0021886 0.1900201 0.0223001 -0.0004262 -0.0039779 -0.0011604 -0.1187435 0.1020648 0.0271953 -0.0004077 0.0145644 0.0687668 0.0013987 -0.0001182 0.0016344 0.1970457 -0.2670222 0.1205842 -0.0013347 -0.0745762 -0.1236765 -0.0007267 0.0131358 -0.0023871 -0.0937703 -0.5034819 0.4223916 -0.00515 0.4160637 -0.1294349 -0.0012183 -0.0048045 -0.0002047 -0.1466214 -0.3614082 0.3422296 -0.0029517 0.3839262 -0.2738274 0.0008375 -0.0046372 -0.0006668 -0.2119637 1.8030224 0.1033113 0.0036171 0.2136176 1.4097 -0.0061887 0.0073519 -0.004286 1.5747568 0.323831 -0.0185476 0.0002437 -0.0784174 0.3179554 -0.0005129 0.0007932 -0.0010572 0.3190111 -0.3916053 0.1137146 0.0053213 0.1267795 -0.5244011 -0.0099702 0.0033835 -0.007871 -0.2051872 0.0142063 0.0230366 -0.0402761 0.0629569 0.0422462 -0.0557202 0.024145 -0.0846319 -0.0031872 -0.0107122 0.0065583 0.0000281 -0.0874737 -0.0334907 0.0019272 0.0008944 0.0017441 0.1128201 0.0141145 0.024585 0.0395357 0.0625071 0.0456023 0.054141 -0.0257828 0.0833142 -0.007059 0.2552633 -0.4578366 0.0044854 -0.5437196 0.2139754 -0.0004561 0.0067704 -0.0001109 0.0980095 0.0887224 0.0048851 0.0001776 0.0196667 0.1366348 0.0008021 0.0001002 0.0006974 0.2066884 -0.7822655 -0.131192 0.1970852 -0.2590468 -0.7433924 0.3714494 0.2813632 0.3098549 -0.9455119 -0.7835758 -0.1128254 -0.2053387 -0.2341285 -0.693796 -0.3546756 -0.300897 -0.2946035 -0.9947883 unknown
polarizability: 99.0575349|-1.8283958|87.2295901|0.006982|-0.2840816|57.916352 unknown
InChI: InChI=1/C4H7BF2N2/c1-9-2-4(5(6)7)8-3-9/h2-3,5,8H,1H3
charge 0 multiplicity 1
16 atoms
C  3.18056269 -0.688841 0.01032582
C  0.65512704 -0.76592943 0.01232186
H  0.62774776 -1.84214797 0.02472373
C  -0.36533059 0.14044691 0.00215356
N  1.85650127 -0.08149764 0.00377203
N  0.27533253 1.36423008 -0.01134043
B  -1.99845658 0.03152646 -0.00198025
H  -0.2162519 2.24564849 -0.02160477
H  -2.46434623 1.16884318 0.03511197
H  3.29700531 -1.31543273 -0.87313123
H  3.93374533 0.09654051 -0.00053292
H  3.29874915 -1.29251132 0.90938372
C  1.59840717 1.22084824 -0.01127581
H  2.33276275 2.00808801 -0.0212712
F  -2.40578501 -0.73145618 1.13390913
F  -2.4023427 -0.64873358 -1.19057822
