program: Gaussian 16
title: MePBF2-H2
version: ES64L-G16RevC.01
method: RwB97XD
basis: GenECP
operation: Freq
keyword: #N
keyword: Geom=AllCheck
keyword: Guess=TCheck
keyword: SCRF=Check
keyword: GenChk
keyword: RwB97XD/GenECP
keyword: Freq
converged: YES YES NO NO
title: Mulliken charges:
elementType: C H H C C H H C N N B F F H H H
charge: -0.959555 0.185481 0.176798 -0.120720 0.082836 0.254243 0.244207 0.056459 -0.103244 -0.179567 0.337980 -0.230929 -0.316002 0.418134 -0.030392 0.184271
chargesum: 0.00000
title: Mulliken charges with hydrogens summed into heavy atoms:
elementType: C C C C N N B F F
charge: -0.413004 0.133522 0.327043 0.056459 0.314890 -0.179567 0.307588 -0.230929 -0.316002
1716.lowfreq: -19.9444 -14.3882 -4.6990 -0.0012 -0.0011 -0.0008 17.8134 36.5254 89.3422
frequency: 14.7303 36.2600 89.3209 145.6293 255.4321 285.6352 343.5730 402.4347 486.9862 582.8055 628.4668 648.1511 681.0935 704.0421 863.7672 900.9846 947.9502 983.1335 1011.1164 1017.3531 1031.2420 1073.3815 1094.9626 1132.7438 1141.8734 1171.8946 1278.5022 1347.0708 1427.2137 1444.0008 1473.7314 1486.4805 1504.7555 1552.5156 1649.7185 2516.9818 3057.8653 3126.6809 3143.7429 3277.6572 3285.6038 3653.2160
redmass: 5.8032 1.0335 5.9809 5.2487 4.4420 4.5007 4.5272 5.0952 8.1468 1.7958 3.4945 2.1130 3.8321 3.3641 1.3471 1.3300 4.1446 3.5361 1.6607 2.1832 3.3296 1.4755 1.4947 1.5595 1.6034 1.6011 1.5418 2.8667 1.3426 2.8464 6.1332 1.0402 1.2667 3.0925 5.2455 1.0844 1.0368 1.1022 1.1024 1.0997 1.1008 1.0838
irintensity: 1.5666 0.2097 0.2998 8.0417 4.1348 2.4349 1.6498 6.3144 11.1139 88.2101 50.5877 33.3460 11.9647 104.5048 20.7119 21.5985 127.5532 178.3763 4.7551 20.5123 61.3094 2.8360 438.0294 220.8320 36.4919 44.9113 18.6779 14.3561 0.5741 27.9055 39.6120 11.6478 39.9395 1.7366 0.9766 290.0001 24.5224 11.4477 12.8171 1.4865 1.4369 262.7523
temp: 298.150 k
press: 1.00000 atm
elementType: 6 1 1 6 6 1 1 6 7 7 5 9 9 1 1 1
symmnumber: 1
zpe: 316416.5 jmol-1
zpe.correction: 0.120517 hartree
zpe.thermalcorrener: 0.129512 hartree
zpe.thermalcorrenthalpy: 0.130457 hartree
zpe.thermalcorrgfe: 0.083996 hartree
zpe.sumelectzpe: -490.674238 hartree
zpe.sumelectthermal: -490.665242 hartree
zpe.sumelectthermalent: -490.664298 hartree
zpe.sumelectthermalfe: -490.710759 hartree
dipole: -4.5473 -0.2275 7.1741
dipole: 8.4969
quadrupole: -72.5614 -53.6724 -117.0175
quadrupole: -36.5690 38.9063 46.0097
quadrupole: 8.5223 27.4114 -35.9337 -36.5690 38.9063 46.0097
hfenergy: -490.7947543 hartree
pointgroup: C01 [X(C4H7B1F2N2)]
dipole: -1.7890573 -0.0894914 2.8225195 debye
dipolederiv: 0.1217249 0.0266503 -0.0214569 0.0013769 0.092631 0.0404035 0.0097866 0.0305782 0.0878942 -0.0161247 -0.0245358 -0.0983203 -0.0429194 0.0753194 0.0146727 -0.0474124 0.0495852 -0.066446 -0.0585026 0.0379846 0.1007814 0.0907505 0.0438132 -0.0184439 0.0388253 0.0286794 0.0279761 0.017077 -0.0331536 -0.0166116 -0.2247468 0.2745313 -0.1352085 0.2066801 -0.3365223 0.1381736 0.2747717 -0.1478013 -0.1130359 0.0685492 0.0367191 -0.1252607 -0.360969 0.0966019 0.2485251 0.0997522 0.0499229 0.0418572 0.0531156 0.132025 0.0212875 0.0444777 0.0232556 0.1264885 0.0959248 0.0543924 0.0104895 0.0429342 0.1183137 0.0197519 0.025169 0.0073827 0.1372932 -0.3402019 0.1702001 -0.0242277 0.1702137 -0.1294455 -0.2289742 -0.0300543 -0.2363238 0.1332886 0.0242286 0.0499575 -0.2446132 0.0386609 -0.5220459 0.4107099 -0.2385215 0.4356642 -0.4056933 -0.5442884 -0.2273892 0.7164525 -0.2557456 -0.0125803 0.1169071 0.5981248 0.0471339 -0.8805923 1.5374031 0.0640808 -0.3082293 0.057263 1.6197827 0.0252409 -0.3847728 -0.0152348 2.078213 -0.5719264 -0.1807305 -0.1279444 -0.031996 -0.7872389 -0.4169342 0.0502402 -0.323194 -1.0303279 -0.5785181 0.1973153 -0.0118068 0.0354099 -1.0463866 0.3151916 0.0612409 0.2702346 -0.7247594 0.3111326 -0.0049386 0.0411762 0.021026 0.3952846 -0.0803948 0.0152801 -0.0655316 0.3948461 -0.4669937 -0.0062732 0.023762 0.0119947 -0.1830631 0.0107624 -0.0023436 0.0226094 -0.2799169 0.0945409 -0.0256817 0.0317274 -0.0358869 -0.1076597 0.0302887 0.0142489 -0.0349188 0.0150374 unknown
polarizability: 79.9017812|-8.0522026|75.419537|-12.9162381|-12.7584277|86.4949587 unknown
InChI: InChI=1/C4H7BF2N2/c1-4-2-8-9(3-4)5(6)7/h2-3,5,8H,1H3
charge 0 multiplicity 1
16 atoms
C  1.44428937 5.25623081 -1.1140337
H  2.22651678 5.36751492 -0.35969728
H  0.50731194 5.61020711 -0.68171378
C  1.0906324 7.09289803 -2.90254689
C  2.86290334 5.82890456 -3.21982662
H  0.19672181 7.60117769 -2.57842466
H  3.66074418 5.10357744 -3.18303199
C  1.77798821 6.02334236 -2.35386986
N  1.74205445 7.474963 -4.01083202
N  2.8198872 6.7152779 -4.20736121
B  3.75161739 6.92921724 -5.51206647
F  3.38154237 5.93927838 -6.43069461
F  3.35039696 8.20580552 -5.97329387
H  1.56153232 8.22892656 -4.65885439
H  4.90685193 6.86412131 -5.16573685
H  1.33480335 4.1910932 -1.32894768
